{"text_format":"1","workbook":"xlsx","n_sheets":8,"sheets":["基金綜合報表","基金屬性","淨值及報酬","風險控管","基金Profile","投資組合-個股別","投資組合-產品別","圖型"],"not_rendered":{"charts":4,"images":0,"macros":1,"external_links":0,"defined_names":17,"comments":7,"pivot_tables":0},"unopened":[],"bounds":{"document_bytes":16777216,"sheet_cells":100000,"rows_first":2000,"rows_last":500,"rows_between":2000,"halvings":0,"cell_chars":16384,"cell_head_chars":4096},"cells_cut":0,"cells_raw":0,"read":"whole","date_system":"1900"}

{"sheet":"基金綜合報表","index":0,"n_rows":73,"n_cols":15,"rows_kept":73,"cut":false,"hidden":false,"merged":[[11,1,11,2],[13,7,13,8],[13,1,13,2],[13,3,13,4],[14,7,14,8],[14,3,14,4],[11,5,11,6],[12,5,12,6],[13,5,13,6],[45,0,45,4],[13,9,13,11],[17,0,18,1],[14,1,14,2],[16,0,16,4],[12,3,12,4],[1,13,1,14],[2,1,2,2],[2,4,2,6],[14,9,14,11],[3,5,3,11],[8,1,8,6],[8,8,8,11],[10,5,10,6],[11,7,11,8],[12,1,12,2],[4,4,4,6],[5,1,5,6],[14,5,14,6],[10,7,10,8],[12,7,12,8],[9,7,9,8],[7,1,7,2],[2,8,2,11],[3,1,3,4],[10,1,10,2],[1,0,1,11],[4,1,4,3],[9,1,9,2],[9,5,9,6],[10,3,10,4],[7,4,7,5],[7,9,7,10],[11,3,11,4],[6,3,6,4],[6,5,6,6],[9,9,9,10],[5,13,5,14],[10,13,10,14],[10,9,10,11],[11,9,11,11],[12,9,12,11]]}
["0050","<<請輸入欲查詢的基金代碼(英文字請輸入大寫)，然後按[REFRESH]更新版面"]
["基金基本資料",null,null,null,null,null,null,null,null,null,null,null,null,"風險控管"]
["　基金代碼",{"$f":"LEFT(基金屬性!A1,FIND(\" \",基金屬性!A1))","v":"0050 "},null,"基金簡稱",{"$f":"MID(基金屬性!A1,FIND(\" \",基金屬性!A1)+1,10)","v":"元大台灣50"},null,null,"統    編",{"$f":"RIGHT(REPT(0,8)&基金屬性!A3,8)","v":"98764389"},null,null,null,null,"資料日期",{"$f":"TEXT(淨值及報酬!B2,\"YYYY/MM/DD\")","v":"2017/09/12"}]
["　中/英文名稱",{"$f":"基金屬性!B3","v":"元大台灣卓越50證券投資信託基金"},null,null,null,{"$f":"基金屬性!C3","v":"Yuanta/P-shares Taiwan Top 50 ETF"},null,null,null,null,null,null,null,"淨值(元)",{"$f":"淨值及報酬!B3","v":83.17}]
["　現任基金經理人",{"$f":"IF(基金屬性!D3=\"\",\"\",基金屬性!D3)","v":"張美媛(2010/05/18到任)"},null,null,{"$f":"IF(基金屬性!E3=\"\",\"\",基金屬性!E3)","v":""},null,null,"經理費",{"$f":"IF(基金屬性!O3=\"\",\"\",基金屬性!O3)","v":0},"~",{"$f":"IF(基金屬性!N3=\"\",\"\",基金屬性!N3)","v":0.32},"%",null,"日報酬率%",{"$f":"淨值及報酬!B4","v":0.44685999999999998}]
["　基金類型",{"$f":"IF(基金屬性!F3=\"\",\"\",基金屬性!F3)","v":"國內指數-一般ETF"},null,null,null,null,null,"保管費",{"$f":"IF(基金屬性!Q3=\"\",\"\",基金屬性!Q3)","v":0},"~",{"$f":"IF(基金屬性!P3=\"\",\"\",基金屬性!P3)","v":3.5000000000000003E-2},"%",null,"12個月"]
["　傘狀基金",{"$f":"基金屬性!G3","v":"N"},"成員",{"$f":"IF($B$7=\"N\",\"\",基金屬性!H3)","v":""},null,{"$f":"IF($B$7=\"N\",\"\",基金屬性!I3)","v":""},null,"銷售費",{"$f":"IF(基金屬性!S3=\"\",\"\",基金屬性!S3)","v":0},"~",{"$f":"IF(基金屬性!R3=\"\",\"\",基金屬性!R3)","v":2},"%",null,"年化標準差",{"$f":"IF(風險控管!B3=\"\",IF(風險控管!C3=\"\",\"\",風險控管!C3),風險控管!B3)","v":5.6302000000000003}]
["　成立資產",{"$f":"基金屬性!J3","v":260820},null,"(千元)",{"$f":"TEXT(基金屬性!K3,\"YYYY/MM/DD\")","v":"2003/06/25"},null,"成立","贖回費","每筆",{"$f":"IF(基金屬性!T3=\"\",\"\",基金屬性!T3)","v":0},null,"元",null,"BETA值",{"$f":"IF(風險控管!B4=\"\",IF(風險控管!C4=\"\",\"\",風險控管!C4),風險控管!B4)","v":1.008}]
["　型        態",{"$f":"基金屬性!L3","v":"國內募集,投資國內"},null,null,null,null,null,"標    的",{"$f":"基金屬性!M3","v":"ETF"},null,null,null,null,"SHARPE值",{"$f":"IF(風險控管!B5=\"\",IF(風險控管!C5=\"\",\"\",風險控管!C5),風險控管!B5)","v":1.0443}]
["　基金淨資產",{"$f":"淨值及報酬!E3","v":0},null,"(千元)   資料時間",null,{"$f":"TEXT(淨值及報酬!E2,\"YYYY/MM/DD\")","v":"1900/01/00"},null," 受益人大會費用",null,{"$f":"IF(基金屬性!U3=\"\",\"\",基金屬性!U3)","v":50},null,"萬元",null,"IR值",{"$f":"IF(風險控管!B6=\"\",IF(風險控管!C6=\"\",\"\",風險控管!C6),風險控管!B6)","v":5.3400000000000003E-2}]
[null,"ㄧ個月",null,"三個月",null,"六個月",null,"ㄧ年",null,"三年",null,null,null,"24個月"]
["同類基金排名",{"$f":"IF(基金Profile!A3=\"\",\"\",基金Profile!A3)","v":"12/17"},null,{"$f":"IF(基金Profile!B3=\"\",\"\",基金Profile!B3)","v":"5/16"},null,{"$f":"IF(基金Profile!C3=\"\",\"\",基金Profile!C3)","v":"4/14"},null,{"$f":"IF(基金Profile!D3=\"\",\"\",基金Profile!D3)","v":"6/14"},null,{"$f":"IF(基金Profile!E3=\"\",\"\",基金Profile!E3)","v":"4/14"},null,null,null,"年化標準差",{"$f":"IF(風險控管!B7=\"\",IF(風險控管!C7=\"\",\"\",風險控管!C7),風險控管!B7)","v":9.0342000000000002}]
["報酬率%",{"$f":"IF(基金Profile!A6=\"\",\"\",基金Profile!A6)","v":2.09},null,{"$f":"IF(基金Profile!B6=\"\",\"\",基金Profile!B6)","v":9.15},null,{"$f":"IF(基金Profile!C6=\"\",\"\",基金Profile!C6)","v":16.46},null,{"$f":"IF(基金Profile!D6=\"\",\"\",基金Profile!D6)","v":24.68},null,{"$f":"IF(基金Profile!E6=\"\",\"\",基金Profile!E6)","v":35.799999999999997},null,null,null,"BETA值",{"$f":"IF(風險控管!B8=\"\",IF(風險控管!C8=\"\",\"\",風險控管!C8),風險控管!B8)","v":1.0752999999999999}]
["BANCHMARK%",{"$f":"IF(基金Profile!A9=\"\",\"\",基金Profile!A9)","v":2.72},null,{"$f":"IF(基金Profile!B9=\"\",\"\",基金Profile!B9)","v":4.95},null,{"$f":"IF(基金Profile!C9=\"\",\"\",基金Profile!C9)","v":10.199999999999999},null,{"$f":"IF(基金Profile!D9=\"\",\"\",基金Profile!D9)","v":18.59},null,{"$f":"IF(基金Profile!E9=\"\",\"\",基金Profile!E9)","v":15.04},null,null,null,"SHARPE值",{"$f":"IF(風險控管!B9=\"\",IF(風險控管!C9=\"\",\"\",風險控管!C9),風險控管!B9)","v":0.58799999999999997}]
["同類基金平均%",{"$f":"IF(基金Profile!A12=\"\",\"\",基金Profile!A12)","v":1.63},null,{"$f":"IF(基金Profile!B12=\"\",\"\",基金Profile!B12)","v":4.04},null,{"$f":"IF(基金Profile!C12=\"\",\"\",基金Profile!C12)","v":6.96},null,{"$f":"IF(基金Profile!D12=\"\",\"\",基金Profile!D12)","v":14.42},null,{"$f":"IF(基金Profile!E12=\"\",\"\",基金Profile!E12)","v":33.58},null,null,null,"IR值",{"$f":"IF(風險控管!B10=\"\",IF(風險控管!C10=\"\",\"\",風險控管!C10),風險控管!B10)","v":0.1106}]
[]
["基金投資組合－產業別"]
["產業別",null,"投資率","比上月","比重"]
[null,null,"%","增減%","排名"]
[{"$f":"IF(OR('投資組合-產品別'!$B3=\"\",'投資組合-產品別'!$B3=0),\"\",'投資組合-產品別'!$A3)","v":"M2324 半導體業"},null,{"$f":"IF($A20=\"\",\"\",VLOOKUP($A20,XX_TEJ14,2,FALSE))","v":36.53},{"$f":"IF($A20=\"\",\"\",VLOOKUP($A20,'投資組合-產品別'!$A:$G,7,FALSE))","v":0.27000000000000313},{"$f":"IF(A20=\"\",\"\",1)","v":1}]
[{"$f":"IF(OR('投資組合-產品別'!$B4=\"\",'投資組合-產品別'!$B4=0),\"\",'投資組合-產品別'!$A4)","v":"M2800 金融保險"},null,15.89,{"$f":"IF($A21=\"\",\"\",VLOOKUP($A21,'投資組合-產品別'!$A:$G,7,FALSE))","v":-4.9999999999998934E-2},{"$f":"IF(A21=\"\",\"\",E20+1)","v":2}]
[{"$f":"IF(OR('投資組合-產品別'!$B5=\"\",'投資組合-產品別'!$B5=0),\"\",'投資組合-產品別'!$A5)","v":"M2331 其他電子業"},null,12.42,{"$f":"IF($A22=\"\",\"\",VLOOKUP($A22,'投資組合-產品別'!$A:$G,7,FALSE))","v":-0.19999999999999929},{"$f":"IF(A22=\"\",\"\",E21+1)","v":3}]
[{"$f":"IF(OR('投資組合-產品別'!$B6=\"\",'投資組合-產品別'!$B6=0),\"\",'投資組合-產品別'!$A6)","v":"M1300 塑膠工業"},null,7.2,{"$f":"IF($A23=\"\",\"\",VLOOKUP($A23,'投資組合-產品別'!$A:$G,7,FALSE))","v":0.15000000000000036},{"$f":"IF(A23=\"\",\"\",E22+1)","v":4}]
[{"$f":"IF(OR('投資組合-產品別'!$B7=\"\",'投資組合-產品別'!$B7=0),\"\",'投資組合-產品別'!$A7)","v":"M2326 光電業"},null,4.96,{"$f":"IF($A24=\"\",\"\",VLOOKUP($A24,'投資組合-產品別'!$A:$G,7,FALSE))","v":0.20000000000000018},5]
[{"$f":"IF(OR('投資組合-產品別'!$B8=\"\",'投資組合-產品別'!$B8=0),\"\",'投資組合-產品別'!$A8)","v":"M2325 電腦及週邊設備業"},null,4.74,{"$f":"IF($A25=\"\",\"\",VLOOKUP($A25,'投資組合-產品別'!$A:$G,7,FALSE))","v":-9.9999999999999645E-2},6]
[{"$f":"IF(OR('投資組合-產品別'!$B9=\"\",'投資組合-產品別'!$B9=0),\"\",'投資組合-產品別'!$A9)","v":"M2327 通訊網路業"},null,4.03,{"$f":"IF($A26=\"\",\"\",VLOOKUP($A26,'投資組合-產品別'!$A:$G,7,FALSE))","v":1.0000000000000675E-2},7]
[{"$f":"IF(OR('投資組合-產品別'!$B10=\"\",'投資組合-產品別'!$B10=0),\"\",'投資組合-產品別'!$A10)","v":"M2328 電子零組件"},null,2.0699999999999998,{"$f":"IF($A27=\"\",\"\",VLOOKUP($A27,'投資組合-產品別'!$A:$G,7,FALSE))","v":2.0000000000000018E-2},8]
[{"$f":"IF(OR('投資組合-產品別'!$B11=\"\",'投資組合-產品別'!$B11=0),\"\",'投資組合-產品別'!$A11)","v":"M1200 食品工業"},null,1.84,{"$f":"IF($A28=\"\",\"\",VLOOKUP($A28,'投資組合-產品別'!$A:$G,7,FALSE))","v":0.19000000000000017},9]
[{"$f":"IF(OR('投資組合-產品別'!$B12=\"\",'投資組合-產品別'!$B12=0),\"\",'投資組合-產品別'!$A12)","v":"M2000 鋼鐵工業"},null,1.83,{"$f":"IF($A29=\"\",\"\",VLOOKUP($A29,'投資組合-產品別'!$A:$G,7,FALSE))","v":0},10]
[{"$f":"IF(OR('投資組合-產品別'!$B13=\"\",'投資組合-產品別'!$B13=0),\"\",'投資組合-產品別'!$A13)","v":"M1100 水泥工業"},null,1.01,{"$f":"IF($A30=\"\",\"\",VLOOKUP($A30,'投資組合-產品別'!$A:$G,7,FALSE))","v":-1.0000000000000009E-2},11]
{"$rows_left_out":44}
{"sheet":"基金屬性","index":1,"n_rows":3,"n_cols":21,"rows_kept":3,"cut":false,"hidden":false,"merged":[]}
["0050 元大台灣50"]
["基金統編","基金全稱","基金英文全稱","現任經理人Ａ","現任經理人Ｂ","公會分類","傘狀基金","傘狀基金成員1","傘狀基金成員2","成立資產","成立日","型態","投資標的","經理費上限%","經理費下限%","保管費上限%","保管費下限%","銷售費上限%","銷售費下限%","贖回費(元)","受益人大會費用(萬元)"]
["98764389","元大台灣卓越50證券投資信託基金","Yuanta/P-shares Taiwan Top 50 ETF","張美媛(2010/05/18到任)",null,"國內指數-一般ETF","N",null,null,260820,"2003-06-25","國內募集,投資國內","ETF",0.32,0,3.5000000000000003E-2,0,2,0,0,50]

{"sheet":"淨值及報酬","index":2,"n_rows":9,"n_cols":4,"rows_kept":9,"cut":false,"hidden":false,"merged":[]}
["0050 元大台灣50"]
["Data Field","2017-09-12",null,"基金淨資產"]
["淨值(元)",83.17]
["淨值變動率%-日",0.44685999999999998]
["近一個月變動率%",2.0866579999999999]
["近三個月變動率%",9.1515210000000007]
["近半年變動率%",16.455566000000001]
["近一年變動率%",24.677568000000001]
["近三年變動率%",35.800469]

{"sheet":"風險控管","index":3,"n_rows":11,"n_cols":3,"rows_kept":11,"cut":false,"hidden":false,"merged":[]}
["0050 元大台灣50"]
["Data Field","2017-09-30","2017-08-31"]
["年化標準差--12個月",5.6302000000000003,5.6205999999999996]
["beta--12個月",1.008,1.0728]
["Sharpe Index-12個月",1.0443,1.0296000000000001]
["IR--12個月（大分類）",5.3400000000000003E-2,0.20280000000000001]
["年化標準差--24個月",9.0342000000000002,9.3303999999999991]
["beta--24個月",1.0752999999999999,1.1084000000000001]
["Sharpe Index-24個月",0.58799999999999997,0.51]
["IR--24個月（大分類）",0.1106,8.0699999999999994E-2]
["淨值",83.17,83.06]

{"sheet":"基金Profile","index":4,"n_rows":12,"n_cols":6,"rows_kept":12,"cut":false,"hidden":false,"merged":[]}
["0050 元大台灣50"]
["一個月排名","三個月排名","六個月排名","一年排名","三年排名","基金淨資產"]
["12/17","5/16","4/14","6/14","4/14",45802812]
[]
["一個月報酬率","三個月報酬率","六個月報酬率","一年報酬率","三年報酬率","基金淨資產"]
["1900-01-02T02:09:36",9.15,16.46,24.68,35.799999999999997,45802812]
[]
["一個月Benchmark ROI","三個月Benchmark ROI","六個月Benchmark ROI","一年Benchmark ROI","三年Benchmark ROI","基金淨資產"]
["1900-01-02T17:16:48",4.95,10.199999999999999,18.59,15.04,45802812]
[]
["一個月基金平均","三個月基金平均","六個月基金平均","一年基金平均","三年基金平均","基金淨資產"]
["1900-01-01T15:07:12",4.04,6.96,14.42,33.58,45802812]

{"sheet":"投資組合-個股別","index":5,"n_rows":10,"n_cols":4,"rows_kept":10,"cut":false,"hidden":false,"merged":[]}
["0050 元大台灣50"]
[null,"2017-08-31","2017-08-31","2017-08-31"]
["投資證券代碼","投資比率％","持股數/流通在外股數%","個股月報酬率％"]
["2330   台積電",30.44,null,0.93230000000000002]
["2317   鴻海",10.26,null,1E-4]
["3008   大立光",3.5,null,7.0202999999999998]
["1301   台塑",2.68,null,3.6425000000000001]
["1303   南亞",2.52,null,0.2631]
["M1300  塑膠工業",5.2,null,3.0183]
["M2300  電子工業",44.2,null,1.4634]

{"sheet":"投資組合-產品別","index":6,"n_rows":84,"n_cols":7,"rows_kept":84,"cut":false,"hidden":false,"merged":[]}
["0050 元大台灣50"]
["Data Field","2017-09-08","2017-09-01","2017-08-25","2017-08-18","2017-08-11","較上月比*"]
["M2324 半導體業",36.53,36.15,36.33,36.21,36.26,{"$f":"B3-F3","v":0.27000000000000313}]
["M2800 金融保險",15.89,15.93,15.82,15.99,15.94,-4.9999999999998934E-2]
["M2331 其他電子業",12.42,12.54,12.46,12.57,12.62,-0.19999999999999929]
["M1300 塑膠工業",7.2,7.08,7.07,7.11,7.05,0.15000000000000036]
["M2326 光電業",4.96,4.8899999999999997,4.97,4.7300000000000004,4.76,0.20000000000000018]
["M2325 電腦及週邊設備業",4.74,4.7699999999999996,4.7300000000000004,4.79,4.84,-9.9999999999999645E-2]
["M2327 通訊網路業",4.03,4.0199999999999996,4,4.04,4.0199999999999996,1.0000000000000675E-2]
["M2328 電子零組件",2.0699999999999998,2.0699999999999998,2.04,2.0699999999999998,2.0499999999999998,2.0000000000000018E-2]
["M1200 食品工業",1.84,1.79,1.81,1.72,1.65,0.19000000000000017]
["M2000 鋼鐵工業",1.83,1.82,1.85,1.83,1.83,0]
["M1100 水泥工業",1.01,1.02,1.03,1.03,1.02,-1.0000000000000009E-2]
["M9700 油電燃氣業",0.86,0.85,0.84,0.83,0.85,1.0000000000000009E-2]
["M2200 汽車工業",0.84,0.83,0.84,0.82,0.86,-2.0000000000000018E-2]
["M2900 貿易百貨",0.82,0.83,0.83,0.84,0.84,-2.0000000000000018E-2]
["M2100 橡膠工業",0.66,0.64,0.64,0.65,0.65,1.0000000000000009E-2]
["M9900 其他",0.61,0.62,0.61,0.63,0.63,-2.0000000000000018E-2]
["M1400 紡織纖維",0.56000000000000005,0.55000000000000004,0.56000000000000005,0.56999999999999995,0.56999999999999995,-9.9999999999998979E-3]
["M2600 航運業",0.31,0.32,0.32,0.31,0.31,0]
["M0000 特殊",0,0,0,0,0,0]
["M1500 電機機械",0,0,0,0,0,0]
["M1600 電器電纜",0,0,0,0,0,0]
["M1721 化學工業",0,0,0,0,0,0]
["M1722 生技醫療業",0,0,0,0,0,0]
["M1800 玻璃陶瓷",0,0,0,0,0,0]
["M1900 造紙工業",0,0,0,0,0,0]
["M2329 電子通路業",0,0,0,0,0,0]
["M2330 資訊服務業",0,0,0,0,0,0]
["M2500 建材營造",0,0,0,0,0,0]
{"$rows_left_out":55}
{"sheet":"圖型","index":7,"n_rows":705,"n_cols":21,"rows_kept":705,"cut":false,"hidden":false,"merged":[[0,13,0,14],[0,16,0,17],[0,19,0,20]]}
["0050 元大台灣50",null,null,null,null,null,"Y9999 加權指數",null,null,null,null,null,{"$f":"MATCH($L$2,M3:M705,0)","v":250},"近一月報酬率",null,null,"近三月報酬率",null,null,"近一年報酬率"]
["年月日","淨值(元)","近一個月變動率%","近三個月變動率%","近一年變動率%",null,"年月日","淨值(元)","近一個月變動率%","近三個月變動率%","近一年變動率%",{"$f":"MIN(M3:M705)","v":"2016-09-06"},null,{"$f":"MID($A$1,FIND(\" \",$A$1)+1,12)","v":"元大台灣50"},"加權指數",null,{"$f":"MID($A$1,FIND(\" \",$A$1)+1,12)","v":"元大台灣50"},"加權指數",null,{"$f":"MID($A$1,FIND(\" \",$A$1)+1,12)","v":"元大台灣50"},"加權指數"]
["2017-09-12",83.17,2.0866579999999999,9.1515210000000007,24.677568000000001,null,"2017-09-12",10610.35,2.718216,4.9494759999999998,18.590353,{"$f":"OFFSET(圖型!M2,圖型!$M$1,2,)","v":0.98689899999999997},{"$f":"IF($A3=\"\",\"\",$A3)","v":"2017-09-12"},{"$f":"IF(ISERROR(VLOOKUP($M3,XX_TEJ6,3,FALSE)=TRUE),\"\",VLOOKUP($M3,XX_TEJ6,3,FALSE))","v":2.0866579999999999},{"$f":"IF(ISERROR(VLOOKUP($M3,XX_TEJ7,3,FALSE)=TRUE),\"\",VLOOKUP($M3,XX_TEJ7,3,FALSE))","v":2.718216},null,{"$f":"IF(ISERROR(VLOOKUP($M3,XX_TEJ6,4,FALSE)=TRUE),\"\",VLOOKUP($M3,XX_TEJ6,4,FALSE))","v":9.1515210000000007},{"$f":"IF(ISERROR(VLOOKUP($M3,XX_TEJ7,4,FALSE)=TRUE),\"\",VLOOKUP($M3,XX_TEJ7,4,FALSE))","v":4.9494759999999998},null,{"$f":"IF(ISERROR(VLOOKUP($M3,XX_TEJ6,5,FALSE)=TRUE),\"\",VLOOKUP($M3,XX_TEJ6,5,FALSE))","v":24.677568000000001},{"$f":"IF(ISERROR(VLOOKUP($M3,XX_TEJ7,5,FALSE)=TRUE),\"\",VLOOKUP($M3,XX_TEJ7,5,FALSE))","v":18.590353}]
["2017-09-11",82.8,1.632503,7.3114520000000001,22.486674000000001,null,"2017-09-11",10572.16,2.3485,3.6521840000000001,16.771836,"=OFFSET(圖型!P2,圖型!$P$1,2,)",{"$f":"IF($A4=\"\",\"\",$A4)","v":"2017-09-11"},1.632503,2.3485,null,7.3114520000000001,3.6521840000000001,null,22.486674000000001,16.771836]
["2017-09-08",83.18,-2.4038E-2,7.5275949999999998,19.854521999999999,null,"2017-09-08",10609.95,0.387739,3.7568769999999998,14.542546,"=OFFSET(圖型!S2,圖型!$S$1,2,)","2017-09-08",-2.4038E-2,0.387739,null,7.5275949999999998,3.7568769999999998,null,19.854521999999999,14.542546]
["2017-09-07",82.65,-0.541516,7.0070430000000004,18.808949999999999,null,"2017-09-07",10538.51,-0.38631799999999999,3.2176330000000002,13.818234,null,"2017-09-07",-0.541516,-0.38631799999999999,null,7.0070430000000004,3.2176330000000002,null,18.808949999999999,13.818234]
["2017-09-06",82.64,0.21828800000000001,7.2005150000000002,20.132729000000001,null,"2017-09-06",10547.86,0.39308799999999999,3.3477760000000001,14.877285000000001,null,"2017-09-06",0.21828800000000001,0.39308799999999999,null,7.2005150000000002,3.3477760000000001,null,20.132729000000001,14.877285000000001]
["2017-09-05",83.21,0.90953200000000001,7.580165,22.269765,null,"2017-09-05",10617.84,1.059148,3.8232729999999999,16.806249999999999,null,"2017-09-05",0.90953200000000001,1.059148,null,7.580165,3.8232729999999999,null,22.269765,16.806249999999999]
["2017-09-04",82.94,0.58209999999999995,8.174023,23.472223,null,"2017-09-04",10569.87,0.602576,4.0530999999999997,17.605688000000001,null,"2017-09-04",0.58209999999999995,0.602576,null,8.174023,4.0530999999999997,null,23.472223,17.605688000000001]
["2017-09-01",83.08,1.6642189999999999,9.0901870000000002,24.200005999999998,null,"2017-09-01",10594.82,1.5093000000000001,5.0300269999999996,17.705182000000001,null,"2017-09-01",1.6642189999999999,1.5093000000000001,null,9.0901870000000002,5.0300269999999996,null,24.200005999999998,17.705182000000001]
["2017-08-31",83.06,1.639745,9.8361099999999997,23.082927999999999,null,"2017-08-31",10585.78,1.5195639999999999,5.4284949999999998,16.726818000000002,null,"2017-08-31",1.639745,1.5195639999999999,null,9.8361099999999997,5.4284949999999998,null,23.082927999999999,16.726818000000002]
["2017-08-30",83.05,1.70218,8.6970089999999995,22.435459000000002,null,"2017-08-30",10569.4,1.4040999999999999,4.6273239999999998,16.012626999999998,null,"2017-08-30",1.70218,1.4040999999999999,null,8.6970089999999995,4.6273239999999998,null,22.435459000000002,16.012626999999998]
["2017-08-29",82.45,0.96742600000000001,7.911721,21.342988999999999,null,"2017-08-29",10496.57,0.70535999999999999,3.9063750000000002,15.218157,null,"2017-08-29",0.96742600000000001,0.70535999999999999,null,7.911721,3.9063750000000002,null,21.342988999999999,15.218157]
["2017-08-28",82.66,1.2245900000000001,8.186572,21.375212999999999,null,"2017-08-28",10525.98,0.98752300000000004,4.1975059999999997,15.268317,null,"2017-08-28",1.2245900000000001,0.98752300000000004,null,8.186572,4.1975059999999997,null,21.375212999999999,15.268317]
["2017-08-25",82.77,1.052554,8.2883840000000006,21.675177999999999,null,"2017-08-25",10515.51,0.50042299999999995,4.026516,15.358945,null,"2017-08-25",1.052554,0.50042299999999995,null,8.2883840000000006,4.026516,null,21.675177999999999,15.358945]
["2017-08-24",82.65,0.91826399999999997,8.9653419999999997,23.164821,null,"2017-08-24",10488.96,0.26459500000000002,4.4257410000000004,16.319374,null,"2017-08-24",0.91826399999999997,0.26459500000000002,null,8.9653419999999997,4.4257410000000004,null,23.164821,16.319374]
["2017-08-23",81.97,0.44059900000000002,8.3663089999999993,21.940273999999999,null,"2017-08-23",10406.81,-0.28639300000000001,3.9865750000000002,15.235196999999999,null,"2017-08-23",0.44059900000000002,-0.28639300000000001,null,8.3663089999999993,3.9865750000000002,null,21.940273999999999,15.235196999999999]
["2017-08-22",81.81,0.24454600000000001,8.3251749999999998,22.407775000000001,null,"2017-08-22",10392.07,-0.42762600000000001,3.949182,15.70129,null,"2017-08-22",0.24454600000000001,-0.42762600000000001,null,8.3251749999999998,3.949182,null,22.407775000000001,15.70129]
["2017-08-21",81.180000000000007,-0.52741400000000005,8.0584469999999992,20.81728,null,"2017-08-21",10326.39,-1.056943,3.8076439999999998,14.302428000000001,null,"2017-08-21",-0.52741400000000005,-1.056943,null,8.0584469999999992,3.8076439999999998,null,20.81728,14.302428000000001]
["2017-08-18",81.260000000000005,-0.86298399999999997,7.8234060000000003,19.728186000000001,null,"2017-08-18",10321.33,-1.5258659999999999,3.5295830000000001,13.141463,null,"2017-08-18",-0.86298399999999997,-1.5258659999999999,null,7.8234060000000003,3.5295830000000001,null,19.728186000000001,13.141463]
["2017-08-17",81.73,0.14651900000000001,7.9358389999999996,20.506672999999999,null,"2017-08-17",10369.370000000001,-0.84312399999999998,3.5521440000000002,13.727914,null,"2017-08-17",0.14651900000000001,-0.84312399999999998,null,7.9358389999999996,3.5521440000000002,null,20.506672999999999,13.727914]
["2017-08-16",81.17,-0.33382099999999998,7.0141169999999997,19.732281,null,"2017-08-16",10290.39,-1.469948,2.580873,12.952617,null,"2017-08-16",-0.33382099999999998,-1.469948,null,7.0141169999999997,2.580873,null,19.732281,12.952617]
["2017-08-15",81.430000000000007,-1.4574999999999999E-2,7.2447480000000004,19.314575000000001,null,"2017-08-15",10311.16,-1.2710760000000001,2.733336,12.708627,null,"2017-08-15",-1.4574999999999999E-2,-1.2710760000000001,null,7.2447480000000004,2.733336,null,19.314575000000001,12.708627]
["2017-08-14",80.77,-0.82496899999999995,6.8499090000000002,18.616869999999999,null,"2017-08-14",10225.280000000001,-2.0933730000000002,2.3877470000000001,11.746931,null,"2017-08-14",-0.82496899999999995,-2.0933730000000002,null,6.8499090000000002,2.3877470000000001,null,18.616869999999999,11.746931]
["2017-08-11",81.47,0.63487000000000005,7.2834199999999996,19.764126000000001,null,"2017-08-11",10329.57,-0.82568699999999995,3.2804139999999999,13.116099999999999,null,"2017-08-11",0.63487000000000005,-0.82568699999999995,null,7.2834199999999996,3.2804139999999999,null,19.764126000000001,13.116099999999999]
["2017-08-10",81.569999999999993,2.6696970000000002,7.9507000000000003,18.945744000000001,null,"2017-08-10",10329.74,0.38707799999999998,3.625686,12.274656999999999,null,"2017-08-10",2.6696970000000002,0.38707799999999998,null,7.9507000000000003,3.625686,null,18.945744000000001,12.274656999999999]
["2017-08-09",82.35,3.7680090000000002,9.3272539999999999,20.679724,null,"2017-08-09",10470.379999999999,1.6813229999999999,5.5963000000000003,14.366887,null,"2017-08-09",3.7680090000000002,1.6813229999999999,null,9.3272539999999999,5.5963000000000003,null,20.679724,14.366887]
["2017-08-08",83.2,4.8390820000000003,10.67423,22.202891999999999,null,"2017-08-08",10568.97,2.638763,6.3570909999999996,15.504587000000001,null,"2017-08-08",4.8390820000000003,2.638763,null,10.67423,6.3570909999999996,null,22.202891999999999,15.504587000000001]
["2017-08-07",83.1,4.7130729999999996,11.467408000000001,23.089200000000002,null,"2017-08-07",10579.38,2.7398579999999999,6.8630719999999998,16.357680999999999,null,"2017-08-07",4.7130729999999996,2.7398579999999999,null,11.467408000000001,6.8630719999999998,null,23.089200000000002,16.357680999999999]
["2017-08-04",82.46,3.8417500000000002,9.8927820000000004,23.344581999999999,null,"2017-08-04",10506.56,1.534435,5.4066960000000002,16.419917999999999,null,"2017-08-04",3.8417500000000002,1.534435,null,9.8927820000000004,5.4066960000000002,null,23.344581999999999,16.419917999999999]
{"$rows_left_out":675}