{"text_format":"1","workbook":"xlsx","n_sheets":8,"sheets":["基金綜合報表","基金屬性","淨值及報酬","風險控管","基金Profile","投資組合-個股別","投資組合-產品別","圖型"],"not_rendered":{"charts":4,"images":0,"macros":1,"external_links":0,"defined_names":17,"comments":7,"pivot_tables":0},"unopened":[],"bounds":{"document_bytes":16777216,"sheet_cells":100000,"rows_first":2000,"rows_last":500,"rows_between":2000,"halvings":0,"cell_chars":16384,"cell_head_chars":4096},"cells_cut":0,"cells_raw":0,"read":"whole","date_system":"1900"}

{"sheet":"基金綜合報表","index":0,"n_rows":73,"n_cols":15,"rows_kept":73,"cut":false,"hidden":false,"merged":[[11,1,11,2],[13,7,13,8],[13,1,13,2],[13,3,13,4],[14,7,14,8],[14,3,14,4],[11,5,11,6],[12,5,12,6],[13,5,13,6],[45,0,45,4],[13,9,13,11],[17,0,18,1],[14,1,14,2],[16,0,16,4],[12,3,12,4],[1,13,1,14],[2,1,2,2],[2,4,2,6],[14,9,14,11],[3,5,3,11],[8,1,8,6],[8,8,8,11],[10,5,10,6],[11,7,11,8],[12,1,12,2],[4,4,4,6],[5,1,5,6],[14,5,14,6],[10,7,10,8],[12,7,12,8],[9,7,9,8],[7,1,7,2],[2,8,2,11],[3,1,3,4],[10,1,10,2],[1,0,1,11],[4,1,4,3],[9,1,9,2],[9,5,9,6],[10,3,10,4],[7,4,7,5],[7,9,7,10],[11,3,11,4],[6,3,6,4],[6,5,6,6],[9,9,9,10],[5,13,5,14],[10,13,10,14],[10,9,10,11],[11,9,11,11],[12,9,12,11]]}
["0050","<<請輸入欲查詢的基金代碼(英文字請輸入大寫)，然後按[REFRESH]更新版面"]
["基金基本資料",null,null,null,null,null,null,null,null,null,null,null,null,"風險控管"]
["　基金代碼",{"$f":"LEFT(基金屬性!A1,FIND(\" \",基金屬性!A1))","v":"0050 "},null,"基金簡稱",{"$f":"MID(基金屬性!A1,FIND(\" \",基金屬性!A1)+1,10)","v":"元大台灣50"},null,null,"統    編",{"$f":"RIGHT(REPT(0,8)&基金屬性!A3,8)","v":"98764389"},null,null,null,null,"資料日期",{"$f":"TEXT(淨值及報酬!B2,\"YYYY/MM/DD\")","v":"2017/09/12"}]
["　中/英文名稱",{"$f":"基金屬性!B3","v":"元大台灣卓越50證券投資信託基金"},null,null,null,{"$f":"基金屬性!C3","v":"Yuanta/P-shares Taiwan Top 50 ETF"},null,null,null,null,null,null,null,"淨值(元)",{"$f":"淨值及報酬!B3","v":83.17}]
["　現任基金經理人",{"$f":"IF(基金屬性!D3=\"\",\"\",基金屬性!D3)","v":"張美媛(2010/05/18到任)"},null,null,{"$f":"IF(基金屬性!E3=\"\",\"\",基金屬性!E3)","v":""},null,null,"經理費",{"$f":"IF(基金屬性!O3=\"\",\"\",基金屬性!O3)","v":0},"~",{"$f":"IF(基金屬性!N3=\"\",\"\",基金屬性!N3)","v":0.32},"%",null,"日報酬率%",{"$f":"淨值及報酬!B4","v":0.44685999999999998}]
["　基金類型",{"$f":"IF(基金屬性!F3=\"\",\"\",基金屬性!F3)","v":"國內指數-一般ETF"},null,null,null,null,null,"保管費",{"$f":"IF(基金屬性!Q3=\"\",\"\",基金屬性!Q3)","v":0},"~",{"$f":"IF(基金屬性!P3=\"\",\"\",基金屬性!P3)","v":3.5000000000000003E-2},"%",null,"12個月"]
["　傘狀基金",{"$f":"基金屬性!G3","v":"N"},"成員",{"$f":"IF($B$7=\"N\",\"\",基金屬性!H3)","v":""},null,{"$f":"IF($B$7=\"N\",\"\",基金屬性!I3)","v":""},null,"銷售費",{"$f":"IF(基金屬性!S3=\"\",\"\",基金屬性!S3)","v":0},"~",{"$f":"IF(基金屬性!R3=\"\",\"\",基金屬性!R3)","v":2},"%",null,"年化標準差",{"$f":"IF(風險控管!B3=\"\",IF(風險控管!C3=\"\",\"\",風險控管!C3),風險控管!B3)","v":5.6302000000000003}]
["　成立資產",{"$f":"基金屬性!J3","v":260820},null,"(千元)",{"$f":"TEXT(基金屬性!K3,\"YYYY/MM/DD\")","v":"2003/06/25"},null,"成立","贖回費","每筆",{"$f":"IF(基金屬性!T3=\"\",\"\",基金屬性!T3)","v":0},null,"元",null,"BETA值",{"$f":"IF(風險控管!B4=\"\",IF(風險控管!C4=\"\",\"\",風險控管!C4),風險控管!B4)","v":1.008}]
["　型        態",{"$f":"基金屬性!L3","v":"國內募集,投資國內"},null,null,null,null,null,"標    的",{"$f":"基金屬性!M3","v":"ETF"},null,null,null,null,"SHARPE值",{"$f":"IF(風險控管!B5=\"\",IF(風險控管!C5=\"\",\"\",風險控管!C5),風險控管!B5)","v":1.0443}]
["　基金淨資產",{"$f":"淨值及報酬!E3","v":0},null,"(千元)   資料時間",null,{"$f":"TEXT(淨值及報酬!E2,\"YYYY/MM/DD\")","v":"1900/01/00"},null," 受益人大會費用",null,{"$f":"IF(基金屬性!U3=\"\",\"\",基金屬性!U3)","v":50},null,"萬元",null,"IR值",{"$f":"IF(風險控管!B6=\"\",IF(風險控管!C6=\"\",\"\",風險控管!C6),風險控管!B6)","v":5.3400000000000003E-2}]
[null,"ㄧ個月",null,"三個月",null,"六個月",null,"ㄧ年",null,"三年",null,null,null,"24個月"]
["同類基金排名",{"$f":"IF(基金Profile!A3=\"\",\"\",基金Profile!A3)","v":"12/17"},null,{"$f":"IF(基金Profile!B3=\"\",\"\",基金Profile!B3)","v":"5/16"},null,{"$f":"IF(基金Profile!C3=\"\",\"\",基金Profile!C3)","v":"4/14"},null,{"$f":"IF(基金Profile!D3=\"\",\"\",基金Profile!D3)","v":"6/14"},null,{"$f":"IF(基金Profile!E3=\"\",\"\",基金Profile!E3)","v":"4/14"},null,null,null,"年化標準差",{"$f":"IF(風險控管!B7=\"\",IF(風險控管!C7=\"\",\"\",風險控管!C7),風險控管!B7)","v":9.0342000000000002}]
["報酬率%",{"$f":"IF(基金Profile!A6=\"\",\"\",基金Profile!A6)","v":2.09},null,{"$f":"IF(基金Profile!B6=\"\",\"\",基金Profile!B6)","v":9.15},null,{"$f":"IF(基金Profile!C6=\"\",\"\",基金Profile!C6)","v":16.46},null,{"$f":"IF(基金Profile!D6=\"\",\"\",基金Profile!D6)","v":24.68},null,{"$f":"IF(基金Profile!E6=\"\",\"\",基金Profile!E6)","v":35.799999999999997},null,null,null,"BETA值",{"$f":"IF(風險控管!B8=\"\",IF(風險控管!C8=\"\",\"\",風險控管!C8),風險控管!B8)","v":1.0752999999999999}]
["BANCHMARK%",{"$f":"IF(基金Profile!A9=\"\",\"\",基金Profile!A9)","v":2.72},null,{"$f":"IF(基金Profile!B9=\"\",\"\",基金Profile!B9)","v":4.95},null,{"$f":"IF(基金Profile!C9=\"\",\"\",基金Profile!C9)","v":10.199999999999999},null,{"$f":"IF(基金Profile!D9=\"\",\"\",基金Profile!D9)","v":18.59},null,{"$f":"IF(基金Profile!E9=\"\",\"\",基金Profile!E9)","v":15.04},null,null,null,"SHARPE值",{"$f":"IF(風險控管!B9=\"\",IF(風險控管!C9=\"\",\"\",風險控管!C9),風險控管!B9)","v":0.58799999999999997}]
["同類基金平均%",{"$f":"IF(基金Profile!A12=\"\",\"\",基金Profile!A12)","v":1.63},null,{"$f":"IF(基金Profile!B12=\"\",\"\",基金Profile!B12)","v":4.04},null,{"$f":"IF(基金Profile!C12=\"\",\"\",基金Profile!C12)","v":6.96},null,{"$f":"IF(基金Profile!D12=\"\",\"\",基金Profile!D12)","v":14.42},null,{"$f":"IF(基金Profile!E12=\"\",\"\",基金Profile!E12)","v":33.58},null,null,null,"IR值",{"$f":"IF(風險控管!B10=\"\",IF(風險控管!C10=\"\",\"\",風險控管!C10),風險控管!B10)","v":0.1106}]
[]
["基金投資組合－產業別"]
["產業別",null,"投資率","比上月","比重"]
[null,null,"%","增減%","排名"]
[{"$f":"IF(OR('投資組合-產品別'!$B3=\"\",'投資組合-產品別'!$B3=0),\"\",'投資組合-產品別'!$A3)","v":"M2324 半導體業"},null,{"$f":"IF($A20=\"\",\"\",VLOOKUP($A20,XX_TEJ14,2,FALSE))","v":36.53},{"$f":"IF($A20=\"\",\"\",VLOOKUP($A20,'投資組合-產品別'!$A:$G,7,FALSE))","v":0.27000000000000313},{"$f":"IF(A20=\"\",\"\",1)","v":1}]
[{"$f":"IF(OR('投資組合-產品別'!$B4=\"\",'投資組合-產品別'!$B4=0),\"\",'投資組合-產品別'!$A4)","v":"M2800 金融保險"},null,15.89,{"$f":"IF($A21=\"\",\"\",VLOOKUP($A21,'投資組合-產品別'!$A:$G,7,FALSE))","v":-4.9999999999998934E-2},{"$f":"IF(A21=\"\",\"\",E20+1)","v":2}]
[{"$f":"IF(OR('投資組合-產品別'!$B5=\"\",'投資組合-產品別'!$B5=0),\"\",'投資組合-產品別'!$A5)","v":"M2331 其他電子業"},null,12.42,{"$f":"IF($A22=\"\",\"\",VLOOKUP($A22,'投資組合-產品別'!$A:$G,7,FALSE))","v":-0.19999999999999929},{"$f":"IF(A22=\"\",\"\",E21+1)","v":3}]
[{"$f":"IF(OR('投資組合-產品別'!$B6=\"\",'投資組合-產品別'!$B6=0),\"\",'投資組合-產品別'!$A6)","v":"M1300 塑膠工業"},null,7.2,{"$f":"IF($A23=\"\",\"\",VLOOKUP($A23,'投資組合-產品別'!$A:$G,7,FALSE))","v":0.15000000000000036},{"$f":"IF(A23=\"\",\"\",E22+1)","v":4}]
[{"$f":"IF(OR('投資組合-產品別'!$B7=\"\",'投資組合-產品別'!$B7=0),\"\",'投資組合-產品別'!$A7)","v":"M2326 光電業"},null,4.96,{"$f":"IF($A24=\"\",\"\",VLOOKUP($A24,'投資組合-產品別'!$A:$G,7,FALSE))","v":0.20000000000000018},5]
[{"$f":"IF(OR('投資組合-產品別'!$B8=\"\",'投資組合-產品別'!$B8=0),\"\",'投資組合-產品別'!$A8)","v":"M2325 電腦及週邊設備業"},null,4.74,{"$f":"IF($A25=\"\",\"\",VLOOKUP($A25,'投資組合-產品別'!$A:$G,7,FALSE))","v":-9.9999999999999645E-2},6]
[{"$f":"IF(OR('投資組合-產品別'!$B9=\"\",'投資組合-產品別'!$B9=0),\"\",'投資組合-產品別'!$A9)","v":"M2327 通訊網路業"},null,4.03,{"$f":"IF($A26=\"\",\"\",VLOOKUP($A26,'投資組合-產品別'!$A:$G,7,FALSE))","v":1.0000000000000675E-2},7]
[{"$f":"IF(OR('投資組合-產品別'!$B10=\"\",'投資組合-產品別'!$B10=0),\"\",'投資組合-產品別'!$A10)","v":"M2328 電子零組件"},null,2.0699999999999998,{"$f":"IF($A27=\"\",\"\",VLOOKUP($A27,'投資組合-產品別'!$A:$G,7,FALSE))","v":2.0000000000000018E-2},8]
[{"$f":"IF(OR('投資組合-產品別'!$B11=\"\",'投資組合-產品別'!$B11=0),\"\",'投資組合-產品別'!$A11)","v":"M1200 食品工業"},null,1.84,{"$f":"IF($A28=\"\",\"\",VLOOKUP($A28,'投資組合-產品別'!$A:$G,7,FALSE))","v":0.19000000000000017},9]
[{"$f":"IF(OR('投資組合-產品別'!$B12=\"\",'投資組合-產品別'!$B12=0),\"\",'投資組合-產品別'!$A12)","v":"M2000 鋼鐵工業"},null,1.83,{"$f":"IF($A29=\"\",\"\",VLOOKUP($A29,'投資組合-產品別'!$A:$G,7,FALSE))","v":0},10]
[{"$f":"IF(OR('投資組合-產品別'!$B13=\"\",'投資組合-產品別'!$B13=0),\"\",'投資組合-產品別'!$A13)","v":"M1100 水泥工業"},null,1.01,{"$f":"IF($A30=\"\",\"\",VLOOKUP($A30,'投資組合-產品別'!$A:$G,7,FALSE))","v":-1.0000000000000009E-2},11]
[{"$f":"IF(OR('投資組合-產品別'!$B14=\"\",'投資組合-產品別'!$B14=0),\"\",'投資組合-產品別'!$A14)","v":"M9700 油電燃氣業"},null,0.86,{"$f":"IF($A31=\"\",\"\",VLOOKUP($A31,'投資組合-產品別'!$A:$G,7,FALSE))","v":1.0000000000000009E-2},12]
[{"$f":"IF(OR('投資組合-產品別'!$B15=\"\",'投資組合-產品別'!$B15=0),\"\",'投資組合-產品別'!$A15)","v":"M2200 汽車工業"},null,0.84,{"$f":"IF($A32=\"\",\"\",VLOOKUP($A32,'投資組合-產品別'!$A:$G,7,FALSE))","v":-2.0000000000000018E-2},13]
[{"$f":"IF(OR('投資組合-產品別'!$B16=\"\",'投資組合-產品別'!$B16=0),\"\",'投資組合-產品別'!$A16)","v":"M2900 貿易百貨"},null,0.82,{"$f":"IF($A33=\"\",\"\",VLOOKUP($A33,'投資組合-產品別'!$A:$G,7,FALSE))","v":-2.0000000000000018E-2},{"$f":"IF(A33=\"\",\"\",E32+1)","v":14}]
[{"$f":"IF(OR('投資組合-產品別'!$B17=\"\",'投資組合-產品別'!$B17=0),\"\",'投資組合-產品別'!$A17)","v":"M2100 橡膠工業"},null,0.66,{"$f":"IF($A34=\"\",\"\",VLOOKUP($A34,'投資組合-產品別'!$A:$G,7,FALSE))","v":1.0000000000000009E-2},15]
[{"$f":"IF(OR('投資組合-產品別'!$B18=\"\",'投資組合-產品別'!$B18=0),\"\",'投資組合-產品別'!$A18)","v":"M9900 其他"},null,0.61,{"$f":"IF($A35=\"\",\"\",VLOOKUP($A35,'投資組合-產品別'!$A:$G,7,FALSE))","v":-2.0000000000000018E-2},16]
[{"$f":"IF(OR('投資組合-產品別'!$B19=\"\",'投資組合-產品別'!$B19=0),\"\",'投資組合-產品別'!$A19)","v":"M1400 紡織纖維"},null,0.56000000000000005,{"$f":"IF($A36=\"\",\"\",VLOOKUP($A36,'投資組合-產品別'!$A:$G,7,FALSE))","v":-9.9999999999998979E-3},17]
[{"$f":"IF(OR('投資組合-產品別'!$B20=\"\",'投資組合-產品別'!$B20=0),\"\",'投資組合-產品別'!$A20)","v":"M2600 航運業"},null,0.31,{"$f":"IF($A37=\"\",\"\",VLOOKUP($A37,'投資組合-產品別'!$A:$G,7,FALSE))","v":0},18]
[{"$f":"IF(OR('投資組合-產品別'!$B21=\"\",'投資組合-產品別'!$B21=0),\"\",'投資組合-產品別'!$A21)","v":""},null,"",{"$f":"IF($A38=\"\",\"\",VLOOKUP($A38,'投資組合-產品別'!$A:$G,7,FALSE))","v":""},""]
[{"$f":"IF(OR('投資組合-產品別'!$B22=\"\",'投資組合-產品別'!$B22=0),\"\",'投資組合-產品別'!$A22)","v":""},null,"",{"$f":"IF($A39=\"\",\"\",VLOOKUP($A39,'投資組合-產品別'!$A:$G,7,FALSE))","v":""},""]
[{"$f":"IF(OR('投資組合-產品別'!$B23=\"\",'投資組合-產品別'!$B23=0),\"\",'投資組合-產品別'!$A23)","v":""},null,"",{"$f":"IF($A40=\"\",\"\",VLOOKUP($A40,'投資組合-產品別'!$A:$G,7,FALSE))","v":""},""]
[{"$f":"IF(OR('投資組合-產品別'!$B24=\"\",'投資組合-產品別'!$B24=0),\"\",'投資組合-產品別'!$A24)","v":""},null,"",{"$f":"IF($A41=\"\",\"\",VLOOKUP($A41,'投資組合-產品別'!$A:$G,7,FALSE))","v":""},""]
["現金部位估計",null,{"$f":"'投資組合-產品別'!B84","v":2.8199999999999932},{"$f":"'投資組合-產品別'!G84","v":-0.43000000000000682},"--"]
["國內合計",null,{"$f":"'投資組合-產品別'!B83","v":97.18},{"$f":"'投資組合-產品別'!G83","v":0.43000000000000682},"--"]
["國外合計",null,{"$f":"'投資組合-產品別'!B82","v":0},{"$f":"'投資組合-產品別'!G82","v":0},"--"]
[]
["基金投資組合－個股別"]
["證券別","投資率","持股數/","個股","比重"]
[{"$f":"IF(A49=\"\",\"本月未公告個股\",\"\")","v":""},"%","流通在外","月報酬%","排名"]
[{"$f":"IF(OR('投資組合-個股別'!$A4=\"\",LEFT('投資組合-個股別'!$A4,1)=\"M\",LEFT('投資組合-個股別'!$A4,1)=\"T\"),\"\",'投資組合-個股別'!$A4)","v":"2330   台積電"},{"$f":"IF($A49=\"\",\"\",VLOOKUP($A49,XX_TEJ16,2,FALSE))","v":30.44},{"$f":"IF($A49=\"\",\"\",VLOOKUP($A49,XX_TEJ16,3,FALSE))","v":0},{"$f":"IF($A49=\"\",\"\",VLOOKUP($A49,XX_TEJ16,4,FALSE))","v":0.93230000000000002},{"$f":"IF($A49=\"\",\"\",1)","v":1}]
[{"$f":"IF(OR('投資組合-個股別'!$A5=\"\",LEFT('投資組合-個股別'!$A5,1)=\"M\",LEFT('投資組合-個股別'!$A5,1)=\"T\"),\"\",'投資組合-個股別'!$A5)","v":"2317   鴻海"},10.26,0,1E-4,{"$f":"IF($A50=\"\",\"\",E49+1)","v":2}]
[{"$f":"IF(OR('投資組合-個股別'!$A6=\"\",LEFT('投資組合-個股別'!$A6,1)=\"M\",LEFT('投資組合-個股別'!$A6,1)=\"T\"),\"\",'投資組合-個股別'!$A6)","v":"3008   大立光"},3.5,0,7.0202999999999998,{"$f":"IF($A51=\"\",\"\",E50+1)","v":3}]
[{"$f":"IF(OR('投資組合-個股別'!$A7=\"\",LEFT('投資組合-個股別'!$A7,1)=\"M\",LEFT('投資組合-個股別'!$A7,1)=\"T\"),\"\",'投資組合-個股別'!$A7)","v":"1301   台塑"},2.68,0,3.6425000000000001,4]
[{"$f":"IF(OR('投資組合-個股別'!$A8=\"\",LEFT('投資組合-個股別'!$A8,1)=\"M\",LEFT('投資組合-個股別'!$A8,1)=\"T\"),\"\",'投資組合-個股別'!$A8)","v":"1303   南亞"},2.52,0,0.2631,5]
[{"$f":"IF(OR('投資組合-個股別'!$A9=\"\",LEFT('投資組合-個股別'!$A9,1)=\"M\",LEFT('投資組合-個股別'!$A9,1)=\"T\"),\"\",'投資組合-個股別'!$A9)","v":""},"","","",""]
[{"$f":"IF(OR('投資組合-個股別'!$A10=\"\",LEFT('投資組合-個股別'!$A10,1)=\"M\",LEFT('投資組合-個股別'!$A10,1)=\"T\"),\"\",'投資組合-個股別'!$A10)","v":""},"","","",""]
[{"$f":"IF(OR('投資組合-個股別'!$A11=\"\",LEFT('投資組合-個股別'!$A11,1)=\"M\",LEFT('投資組合-個股別'!$A11,1)=\"T\"),\"\",'投資組合-個股別'!$A11)","v":""},"","","",""]
[{"$f":"IF(OR('投資組合-個股別'!$A12=\"\",LEFT('投資組合-個股別'!$A12,1)=\"M\",LEFT('投資組合-個股別'!$A12,1)=\"T\"),\"\",'投資組合-個股別'!$A12)","v":""},"","","",""]
[{"$f":"IF(OR('投資組合-個股別'!$A13=\"\",LEFT('投資組合-個股別'!$A13,1)=\"M\",LEFT('投資組合-個股別'!$A13,1)=\"T\"),\"\",'投資組合-個股別'!$A13)","v":""},"","","",""]
[{"$f":"IF(OR('投資組合-個股別'!$A14=\"\",LEFT('投資組合-個股別'!$A14,1)=\"M\",LEFT('投資組合-個股別'!$A14,1)=\"T\"),\"\",'投資組合-個股別'!$A14)","v":""},"","","",""]
[{"$f":"IF(OR('投資組合-個股別'!$A15=\"\",LEFT('投資組合-個股別'!$A15,1)=\"M\",LEFT('投資組合-個股別'!$A15,1)=\"T\"),\"\",'投資組合-個股別'!$A15)","v":""},"","","",""]
[{"$f":"IF(OR('投資組合-個股別'!$A16=\"\",LEFT('投資組合-個股別'!$A16,1)=\"M\",LEFT('投資組合-個股別'!$A16,1)=\"T\"),\"\",'投資組合-個股別'!$A16)","v":""},"","","",""]
[{"$f":"IF(OR('投資組合-個股別'!$A17=\"\",LEFT('投資組合-個股別'!$A17,1)=\"M\",LEFT('投資組合-個股別'!$A17,1)=\"T\"),\"\",'投資組合-個股別'!$A17)","v":""},"","","",""]
[{"$f":"IF(OR('投資組合-個股別'!$A18=\"\",LEFT('投資組合-個股別'!$A18,1)=\"M\",LEFT('投資組合-個股別'!$A18,1)=\"T\"),\"\",'投資組合-個股別'!$A18)","v":""},"","","",""]
[{"$f":"IF(OR('投資組合-個股別'!$A19=\"\",LEFT('投資組合-個股別'!$A19,1)=\"M\",LEFT('投資組合-個股別'!$A19,1)=\"T\"),\"\",'投資組合-個股別'!$A19)","v":""},"","","",""]
[{"$f":"IF(OR('投資組合-個股別'!$A20=\"\",LEFT('投資組合-個股別'!$A20,1)=\"M\",LEFT('投資組合-個股別'!$A20,1)=\"T\"),\"\",'投資組合-個股別'!$A20)","v":""},"","","",""]
[{"$f":"IF(OR('投資組合-個股別'!$A21=\"\",LEFT('投資組合-個股別'!$A21,1)=\"M\",LEFT('投資組合-個股別'!$A21,1)=\"T\"),\"\",'投資組合-個股別'!$A21)","v":""},"","","",""]
[{"$f":"IF(OR('投資組合-個股別'!$A22=\"\",LEFT('投資組合-個股別'!$A22,1)=\"M\",LEFT('投資組合-個股別'!$A22,1)=\"T\"),\"\",'投資組合-個股別'!$A22)","v":""},"","","",""]
[{"$f":"IF(OR('投資組合-個股別'!$A23=\"\",LEFT('投資組合-個股別'!$A23,1)=\"M\",LEFT('投資組合-個股別'!$A23,1)=\"T\"),\"\",'投資組合-個股別'!$A23)","v":""},"","","",""]
[{"$f":"IF(OR('投資組合-個股別'!$A24=\"\",LEFT('投資組合-個股別'!$A24,1)=\"M\",LEFT('投資組合-個股別'!$A24,1)=\"T\"),\"\",'投資組合-個股別'!$A24)","v":""},"","","",""]
[{"$f":"IF(OR('投資組合-個股別'!$A25=\"\",LEFT('投資組合-個股別'!$A25,1)=\"M\",LEFT('投資組合-個股別'!$A25,1)=\"T\"),\"\",'投資組合-個股別'!$A25)","v":""},"","","",""]
[{"$f":"IF(OR('投資組合-個股別'!$A26=\"\",LEFT('投資組合-個股別'!$A26,1)=\"M\",LEFT('投資組合-個股別'!$A26,1)=\"T\"),\"\",'投資組合-個股別'!$A26)","v":""},"","","",""]
[{"$f":"IF(OR('投資組合-個股別'!$A27=\"\",LEFT('投資組合-個股別'!$A27,1)=\"M\",LEFT('投資組合-個股別'!$A27,1)=\"T\"),\"\",'投資組合-個股別'!$A27)","v":""},"","","",""]
[{"$f":"IF(OR('投資組合-個股別'!$A28=\"\",LEFT('投資組合-個股別'!$A28,1)=\"M\",LEFT('投資組合-個股別'!$A28,1)=\"T\"),\"\",'投資組合-個股別'!$A28)","v":""},"","","",""]

{"sheet":"基金屬性","index":1,"n_rows":3,"n_cols":21,"rows_kept":3,"cut":false,"hidden":false,"merged":[]}
["0050 元大台灣50"]
["基金統編","基金全稱","基金英文全稱","現任經理人Ａ","現任經理人Ｂ","公會分類","傘狀基金","傘狀基金成員1","傘狀基金成員2","成立資產","成立日","型態","投資標的","經理費上限%","經理費下限%","保管費上限%","保管費下限%","銷售費上限%","銷售費下限%","贖回費(元)","受益人大會費用(萬元)"]
["98764389","元大台灣卓越50證券投資信託基金","Yuanta/P-shares Taiwan Top 50 ETF","張美媛(2010/05/18到任)",null,"國內指數-一般ETF","N",null,null,260820,"2003-06-25","國內募集,投資國內","ETF",0.32,0,3.5000000000000003E-2,0,2,0,0,50]

{"sheet":"淨值及報酬","index":2,"n_rows":9,"n_cols":4,"rows_kept":9,"cut":false,"hidden":false,"merged":[]}
["0050 元大台灣50"]
["Data Field","2017-09-12",null,"基金淨資產"]
["淨值(元)",83.17]
["淨值變動率%-日",0.44685999999999998]
["近一個月變動率%",2.0866579999999999]
["近三個月變動率%",9.1515210000000007]
["近半年變動率%",16.455566000000001]
["近一年變動率%",24.677568000000001]
["近三年變動率%",35.800469]

{"sheet":"風險控管","index":3,"n_rows":11,"n_cols":3,"rows_kept":11,"cut":false,"hidden":false,"merged":[]}
["0050 元大台灣50"]
["Data Field","2017-09-30","2017-08-31"]
["年化標準差--12個月",5.6302000000000003,5.6205999999999996]
["beta--12個月",1.008,1.0728]
["Sharpe Index-12個月",1.0443,1.0296000000000001]
["IR--12個月（大分類）",5.3400000000000003E-2,0.20280000000000001]
["年化標準差--24個月",9.0342000000000002,9.3303999999999991]
["beta--24個月",1.0752999999999999,1.1084000000000001]
["Sharpe Index-24個月",0.58799999999999997,0.51]
["IR--24個月（大分類）",0.1106,8.0699999999999994E-2]
["淨值",83.17,83.06]

{"sheet":"基金Profile","index":4,"n_rows":12,"n_cols":6,"rows_kept":12,"cut":false,"hidden":false,"merged":[]}
["0050 元大台灣50"]
["一個月排名","三個月排名","六個月排名","一年排名","三年排名","基金淨資產"]
["12/17","5/16","4/14","6/14","4/14",45802812]
[]
["一個月報酬率","三個月報酬率","六個月報酬率","一年報酬率","三年報酬率","基金淨資產"]
["1900-01-02T02:09:36",9.15,16.46,24.68,35.799999999999997,45802812]
[]
["一個月Benchmark ROI","三個月Benchmark ROI","六個月Benchmark ROI","一年Benchmark ROI","三年Benchmark ROI","基金淨資產"]
["1900-01-02T17:16:48",4.95,10.199999999999999,18.59,15.04,45802812]
[]
["一個月基金平均","三個月基金平均","六個月基金平均","一年基金平均","三年基金平均","基金淨資產"]
["1900-01-01T15:07:12",4.04,6.96,14.42,33.58,45802812]

{"sheet":"投資組合-個股別","index":5,"n_rows":10,"n_cols":4,"rows_kept":10,"cut":false,"hidden":false,"merged":[]}
["0050 元大台灣50"]
[null,"2017-08-31","2017-08-31","2017-08-31"]
["投資證券代碼","投資比率％","持股數/流通在外股數%","個股月報酬率％"]
["2330   台積電",30.44,null,0.93230000000000002]
["2317   鴻海",10.26,null,1E-4]
["3008   大立光",3.5,null,7.0202999999999998]
["1301   台塑",2.68,null,3.6425000000000001]
["1303   南亞",2.52,null,0.2631]
["M1300  塑膠工業",5.2,null,3.0183]
["M2300  電子工業",44.2,null,1.4634]

{"sheet":"投資組合-產品別","index":6,"n_rows":84,"n_cols":7,"rows_kept":84,"cut":false,"hidden":false,"merged":[]}
["0050 元大台灣50"]
["Data Field","2017-09-08","2017-09-01","2017-08-25","2017-08-18","2017-08-11","較上月比*"]
["M2324 半導體業",36.53,36.15,36.33,36.21,36.26,{"$f":"B3-F3","v":0.27000000000000313}]
["M2800 金融保險",15.89,15.93,15.82,15.99,15.94,-4.9999999999998934E-2]
["M2331 其他電子業",12.42,12.54,12.46,12.57,12.62,-0.19999999999999929]
["M1300 塑膠工業",7.2,7.08,7.07,7.11,7.05,0.15000000000000036]
["M2326 光電業",4.96,4.8899999999999997,4.97,4.7300000000000004,4.76,0.20000000000000018]
["M2325 電腦及週邊設備業",4.74,4.7699999999999996,4.7300000000000004,4.79,4.84,-9.9999999999999645E-2]
["M2327 通訊網路業",4.03,4.0199999999999996,4,4.04,4.0199999999999996,1.0000000000000675E-2]
["M2328 電子零組件",2.0699999999999998,2.0699999999999998,2.04,2.0699999999999998,2.0499999999999998,2.0000000000000018E-2]
["M1200 食品工業",1.84,1.79,1.81,1.72,1.65,0.19000000000000017]
["M2000 鋼鐵工業",1.83,1.82,1.85,1.83,1.83,0]
["M1100 水泥工業",1.01,1.02,1.03,1.03,1.02,-1.0000000000000009E-2]
["M9700 油電燃氣業",0.86,0.85,0.84,0.83,0.85,1.0000000000000009E-2]
["M2200 汽車工業",0.84,0.83,0.84,0.82,0.86,-2.0000000000000018E-2]
["M2900 貿易百貨",0.82,0.83,0.83,0.84,0.84,-2.0000000000000018E-2]
["M2100 橡膠工業",0.66,0.64,0.64,0.65,0.65,1.0000000000000009E-2]
["M9900 其他",0.61,0.62,0.61,0.63,0.63,-2.0000000000000018E-2]
["M1400 紡織纖維",0.56000000000000005,0.55000000000000004,0.56000000000000005,0.56999999999999995,0.56999999999999995,-9.9999999999998979E-3]
["M2600 航運業",0.31,0.32,0.32,0.31,0.31,0]
["M0000 特殊",0,0,0,0,0,0]
["M1500 電機機械",0,0,0,0,0,0]
["M1600 電器電纜",0,0,0,0,0,0]
["M1721 化學工業",0,0,0,0,0,0]
["M1722 生技醫療業",0,0,0,0,0,0]
["M1800 玻璃陶瓷",0,0,0,0,0,0]
["M1900 造紙工業",0,0,0,0,0,0]
["M2329 電子通路業",0,0,0,0,0,0]
["M2330 資訊服務業",0,0,0,0,0,0]
["M2500 建材營造",0,0,0,0,0,0]
["M2700 觀光事業",0,0,0,0,0,0]
["M9800 綜合產業",0,0,0,0,0,0]
["MUUUU 承銷",0,0,0,0,0,0]
["MWWWW 認購權證",0,0,0,0,0,0]
["OTC00 OTC 特殊",0,0,0,0,0,{"$f":"B35-F35","v":0}]
["OTC12 OTC 食品類",0,0,0,0,0,0]
["OTC13 OTC 塑膠類",0,0,0,0,0,0]
["OTC14 OTC 紡織",0,0,0,0,0,0]
["OTC15 OTC 電機",0,0,0,0,0,0]
["OTC16 OTC 電纜類",0,0,0,0,0,0]
["O1721 OTC 化學工業",0,0,0,0,0,0]
["O1722 OTC 生技醫療",0,0,0,0,0,0]
["OTC18 OTC 玻璃",0,0,0,0,0,0]
["OTC20 OTC 鋼鐵類",0,0,0,0,0,0]
["OTC21 OTC 橡膠類",0,0,0,0,0,0]
["O2324 OTC 半導體業",0,0,0,0,0,0]
["O2325 OTC 電腦及週邊設備業",0,0,0,0,0,0]
["O2326 OTC 光電業",0,0,0,0,0,0]
["O2327 OTC 通訊網路業",0,0,0,0,0,0]
["O2328 OTC 電子零組件",0,0,0,0,0,0]
["O2329 OTC 電子通路業",0,0,0,0,0,0]
["O2330 OTC 資訊服務業",0,0,0,0,0,0]
["O2331 OTC 其他電子業",0,0,0,0,0,0]
["OTC25 OTC 營造",0,0,0,0,0,0]
["OTC26 OTC 運輸類",0,0,0,0,0,0]
["OTC27 OTC 觀光類",0,0,0,0,0,0]
["OTC28 OTC 金融類",0,0,0,0,0,0]
["OTC29 OTC 百貨類",0,0,0,0,0,0]
["OTC89 OTC 其它類",0,0,0,0,0,0]
["OTC97 OTC 油電燃氣業",0,0,0,0,0,0]
["OTC30 OTC 證券類",null,null,null,null,null,0]
["F0001 美國",null,null,null,null,null,0]
["F0002 日本",null,null,null,null,null,0]
["F0003 歐洲",null,null,null,null,null,0]
["F0004 紐澳",null,null,null,null,null,0]
["F0005 東南亞",null,null,null,null,null,0]
["F0006 海外其他",null,null,null,null,null,{"$f":"B67-F67","v":0}]
["F0007 北美",null,null,null,null,null,0]
["F0008 已開發歐洲",null,null,null,null,null,0]
["F0009 亞不含日本",null,null,null,null,null,0]
["F0010 新興歐洲",null,null,null,null,null,0]
["F0011 新興拉美",null,null,null,null,null,0]
["ZAA   買斷債券",null,null,null,null,null,0]
["ZBB   附條件債券",null,null,null,null,null,0]
["ZCC   存放金融機",null,null,null,null,null,0]
["ZDD   短期票券",null,null,null,null,null,0]
["ZEE   其他投資",null,null,null,null,null,0]
[]
["* 實為較4週前比較，持股率的增減"]
[]
["Data Field","2017-09-08","2017-09-01","2017-08-25","2017-08-18","2017-08-11","較上月比*"]
["TT99F 國外合計",0,0,0,0,0,{"$f":"B82-F82","v":0}]
["TT99L 國內合計",97.18,96.72,96.75,96.74,96.75,{"$f":"B83-F83","v":0.43000000000000682}]
["現金部位估計",{"$f":"100-B82-B83","v":2.8199999999999932},{"$f":"100-C82-C83","v":3.2800000000000011},{"$f":"100-D82-D83","v":3.25},{"$f":"100-E82-E83","v":3.2600000000000051},{"$f":"100-F82-F83","v":3.25},{"$f":"B84-F84","v":-0.43000000000000682}]

{"sheet":"圖型","index":7,"n_rows":705,"n_cols":21,"rows_kept":705,"cut":false,"hidden":false,"merged":[[0,13,0,14],[0,16,0,17],[0,19,0,20]]}
["0050 元大台灣50",null,null,null,null,null,"Y9999 加權指數",null,null,null,null,null,{"$f":"MATCH($L$2,M3:M705,0)","v":250},"近一月報酬率",null,null,"近三月報酬率",null,null,"近一年報酬率"]
["年月日","淨值(元)","近一個月變動率%","近三個月變動率%","近一年變動率%",null,"年月日","淨值(元)","近一個月變動率%","近三個月變動率%","近一年變動率%",{"$f":"MIN(M3:M705)","v":"2016-09-06"},null,{"$f":"MID($A$1,FIND(\" \",$A$1)+1,12)","v":"元大台灣50"},"加權指數",null,{"$f":"MID($A$1,FIND(\" \",$A$1)+1,12)","v":"元大台灣50"},"加權指數",null,{"$f":"MID($A$1,FIND(\" \",$A$1)+1,12)","v":"元大台灣50"},"加權指數"]
["2017-09-12",83.17,2.0866579999999999,9.1515210000000007,24.677568000000001,null,"2017-09-12",10610.35,2.718216,4.9494759999999998,18.590353,{"$f":"OFFSET(圖型!M2,圖型!$M$1,2,)","v":0.98689899999999997},{"$f":"IF($A3=\"\",\"\",$A3)","v":"2017-09-12"},{"$f":"IF(ISERROR(VLOOKUP($M3,XX_TEJ6,3,FALSE)=TRUE),\"\",VLOOKUP($M3,XX_TEJ6,3,FALSE))","v":2.0866579999999999},{"$f":"IF(ISERROR(VLOOKUP($M3,XX_TEJ7,3,FALSE)=TRUE),\"\",VLOOKUP($M3,XX_TEJ7,3,FALSE))","v":2.718216},null,{"$f":"IF(ISERROR(VLOOKUP($M3,XX_TEJ6,4,FALSE)=TRUE),\"\",VLOOKUP($M3,XX_TEJ6,4,FALSE))","v":9.1515210000000007},{"$f":"IF(ISERROR(VLOOKUP($M3,XX_TEJ7,4,FALSE)=TRUE),\"\",VLOOKUP($M3,XX_TEJ7,4,FALSE))","v":4.9494759999999998},null,{"$f":"IF(ISERROR(VLOOKUP($M3,XX_TEJ6,5,FALSE)=TRUE),\"\",VLOOKUP($M3,XX_TEJ6,5,FALSE))","v":24.677568000000001},{"$f":"IF(ISERROR(VLOOKUP($M3,XX_TEJ7,5,FALSE)=TRUE),\"\",VLOOKUP($M3,XX_TEJ7,5,FALSE))","v":18.590353}]
["2017-09-11",82.8,1.632503,7.3114520000000001,22.486674000000001,null,"2017-09-11",10572.16,2.3485,3.6521840000000001,16.771836,"=OFFSET(圖型!P2,圖型!$P$1,2,)",{"$f":"IF($A4=\"\",\"\",$A4)","v":"2017-09-11"},1.632503,2.3485,null,7.3114520000000001,3.6521840000000001,null,22.486674000000001,16.771836]
["2017-09-08",83.18,-2.4038E-2,7.5275949999999998,19.854521999999999,null,"2017-09-08",10609.95,0.387739,3.7568769999999998,14.542546,"=OFFSET(圖型!S2,圖型!$S$1,2,)","2017-09-08",-2.4038E-2,0.387739,null,7.5275949999999998,3.7568769999999998,null,19.854521999999999,14.542546]
["2017-09-07",82.65,-0.541516,7.0070430000000004,18.808949999999999,null,"2017-09-07",10538.51,-0.38631799999999999,3.2176330000000002,13.818234,null,"2017-09-07",-0.541516,-0.38631799999999999,null,7.0070430000000004,3.2176330000000002,null,18.808949999999999,13.818234]
["2017-09-06",82.64,0.21828800000000001,7.2005150000000002,20.132729000000001,null,"2017-09-06",10547.86,0.39308799999999999,3.3477760000000001,14.877285000000001,null,"2017-09-06",0.21828800000000001,0.39308799999999999,null,7.2005150000000002,3.3477760000000001,null,20.132729000000001,14.877285000000001]
["2017-09-05",83.21,0.90953200000000001,7.580165,22.269765,null,"2017-09-05",10617.84,1.059148,3.8232729999999999,16.806249999999999,null,"2017-09-05",0.90953200000000001,1.059148,null,7.580165,3.8232729999999999,null,22.269765,16.806249999999999]
["2017-09-04",82.94,0.58209999999999995,8.174023,23.472223,null,"2017-09-04",10569.87,0.602576,4.0530999999999997,17.605688000000001,null,"2017-09-04",0.58209999999999995,0.602576,null,8.174023,4.0530999999999997,null,23.472223,17.605688000000001]
["2017-09-01",83.08,1.6642189999999999,9.0901870000000002,24.200005999999998,null,"2017-09-01",10594.82,1.5093000000000001,5.0300269999999996,17.705182000000001,null,"2017-09-01",1.6642189999999999,1.5093000000000001,null,9.0901870000000002,5.0300269999999996,null,24.200005999999998,17.705182000000001]
["2017-08-31",83.06,1.639745,9.8361099999999997,23.082927999999999,null,"2017-08-31",10585.78,1.5195639999999999,5.4284949999999998,16.726818000000002,null,"2017-08-31",1.639745,1.5195639999999999,null,9.8361099999999997,5.4284949999999998,null,23.082927999999999,16.726818000000002]
["2017-08-30",83.05,1.70218,8.6970089999999995,22.435459000000002,null,"2017-08-30",10569.4,1.4040999999999999,4.6273239999999998,16.012626999999998,null,"2017-08-30",1.70218,1.4040999999999999,null,8.6970089999999995,4.6273239999999998,null,22.435459000000002,16.012626999999998]
["2017-08-29",82.45,0.96742600000000001,7.911721,21.342988999999999,null,"2017-08-29",10496.57,0.70535999999999999,3.9063750000000002,15.218157,null,"2017-08-29",0.96742600000000001,0.70535999999999999,null,7.911721,3.9063750000000002,null,21.342988999999999,15.218157]
["2017-08-28",82.66,1.2245900000000001,8.186572,21.375212999999999,null,"2017-08-28",10525.98,0.98752300000000004,4.1975059999999997,15.268317,null,"2017-08-28",1.2245900000000001,0.98752300000000004,null,8.186572,4.1975059999999997,null,21.375212999999999,15.268317]
["2017-08-25",82.77,1.052554,8.2883840000000006,21.675177999999999,null,"2017-08-25",10515.51,0.50042299999999995,4.026516,15.358945,null,"2017-08-25",1.052554,0.50042299999999995,null,8.2883840000000006,4.026516,null,21.675177999999999,15.358945]
["2017-08-24",82.65,0.91826399999999997,8.9653419999999997,23.164821,null,"2017-08-24",10488.96,0.26459500000000002,4.4257410000000004,16.319374,null,"2017-08-24",0.91826399999999997,0.26459500000000002,null,8.9653419999999997,4.4257410000000004,null,23.164821,16.319374]
["2017-08-23",81.97,0.44059900000000002,8.3663089999999993,21.940273999999999,null,"2017-08-23",10406.81,-0.28639300000000001,3.9865750000000002,15.235196999999999,null,"2017-08-23",0.44059900000000002,-0.28639300000000001,null,8.3663089999999993,3.9865750000000002,null,21.940273999999999,15.235196999999999]
["2017-08-22",81.81,0.24454600000000001,8.3251749999999998,22.407775000000001,null,"2017-08-22",10392.07,-0.42762600000000001,3.949182,15.70129,null,"2017-08-22",0.24454600000000001,-0.42762600000000001,null,8.3251749999999998,3.949182,null,22.407775000000001,15.70129]
["2017-08-21",81.180000000000007,-0.52741400000000005,8.0584469999999992,20.81728,null,"2017-08-21",10326.39,-1.056943,3.8076439999999998,14.302428000000001,null,"2017-08-21",-0.52741400000000005,-1.056943,null,8.0584469999999992,3.8076439999999998,null,20.81728,14.302428000000001]
["2017-08-18",81.260000000000005,-0.86298399999999997,7.8234060000000003,19.728186000000001,null,"2017-08-18",10321.33,-1.5258659999999999,3.5295830000000001,13.141463,null,"2017-08-18",-0.86298399999999997,-1.5258659999999999,null,7.8234060000000003,3.5295830000000001,null,19.728186000000001,13.141463]
["2017-08-17",81.73,0.14651900000000001,7.9358389999999996,20.506672999999999,null,"2017-08-17",10369.370000000001,-0.84312399999999998,3.5521440000000002,13.727914,null,"2017-08-17",0.14651900000000001,-0.84312399999999998,null,7.9358389999999996,3.5521440000000002,null,20.506672999999999,13.727914]
["2017-08-16",81.17,-0.33382099999999998,7.0141169999999997,19.732281,null,"2017-08-16",10290.39,-1.469948,2.580873,12.952617,null,"2017-08-16",-0.33382099999999998,-1.469948,null,7.0141169999999997,2.580873,null,19.732281,12.952617]
["2017-08-15",81.430000000000007,-1.4574999999999999E-2,7.2447480000000004,19.314575000000001,null,"2017-08-15",10311.16,-1.2710760000000001,2.733336,12.708627,null,"2017-08-15",-1.4574999999999999E-2,-1.2710760000000001,null,7.2447480000000004,2.733336,null,19.314575000000001,12.708627]
["2017-08-14",80.77,-0.82496899999999995,6.8499090000000002,18.616869999999999,null,"2017-08-14",10225.280000000001,-2.0933730000000002,2.3877470000000001,11.746931,null,"2017-08-14",-0.82496899999999995,-2.0933730000000002,null,6.8499090000000002,2.3877470000000001,null,18.616869999999999,11.746931]
["2017-08-11",81.47,0.63487000000000005,7.2834199999999996,19.764126000000001,null,"2017-08-11",10329.57,-0.82568699999999995,3.2804139999999999,13.116099999999999,null,"2017-08-11",0.63487000000000005,-0.82568699999999995,null,7.2834199999999996,3.2804139999999999,null,19.764126000000001,13.116099999999999]
["2017-08-10",81.569999999999993,2.6696970000000002,7.9507000000000003,18.945744000000001,null,"2017-08-10",10329.74,0.38707799999999998,3.625686,12.274656999999999,null,"2017-08-10",2.6696970000000002,0.38707799999999998,null,7.9507000000000003,3.625686,null,18.945744000000001,12.274656999999999]
["2017-08-09",82.35,3.7680090000000002,9.3272539999999999,20.679724,null,"2017-08-09",10470.379999999999,1.6813229999999999,5.5963000000000003,14.366887,null,"2017-08-09",3.7680090000000002,1.6813229999999999,null,9.3272539999999999,5.5963000000000003,null,20.679724,14.366887]
["2017-08-08",83.2,4.8390820000000003,10.67423,22.202891999999999,null,"2017-08-08",10568.97,2.638763,6.3570909999999996,15.504587000000001,null,"2017-08-08",4.8390820000000003,2.638763,null,10.67423,6.3570909999999996,null,22.202891999999999,15.504587000000001]
["2017-08-07",83.1,4.7130729999999996,11.467408000000001,23.089200000000002,null,"2017-08-07",10579.38,2.7398579999999999,6.8630719999999998,16.357680999999999,null,"2017-08-07",4.7130729999999996,2.7398579999999999,null,11.467408000000001,6.8630719999999998,null,23.089200000000002,16.357680999999999]
["2017-08-04",82.46,3.8417500000000002,9.8927820000000004,23.344581999999999,null,"2017-08-04",10506.56,1.534435,5.4066960000000002,16.419917999999999,null,"2017-08-04",3.8417500000000002,1.534435,null,9.8927820000000004,5.4066960000000002,null,23.344581999999999,16.419917999999999]
["2017-08-03",82.25,2.7180010000000001,9.6274049999999995,23.513636000000002,null,"2017-08-03",10469.879999999999,0.54826799999999998,5.1685879999999997,16.309901,null,"2017-08-03",2.7180010000000001,0.54826799999999998,null,9.6274049999999995,5.1685879999999997,null,23.513636000000002,16.309901]
["2017-08-02",82.71,3.6389619999999998,10.664633,22.970237000000001,null,"2017-08-02",10519.27,1.1947970000000001,5.814146,15.994579,null,"2017-08-02",3.6389619999999998,1.1947970000000001,null,10.664633,5.814146,null,22.970237000000001,15.994579]
["2017-08-01",81.72,2.3984519999999998,10.27631,21.358526999999999,null,"2017-08-01",10437.290000000001,0.40615400000000002,5.7261949999999997,14.93914,null,"2017-08-01",2.3984519999999998,0.40615400000000002,null,10.27631,5.7261949999999997,null,21.358526999999999,14.93914]
["2017-07-31",81.72,2.3984519999999998,10.27631,23.183600999999999,null,"2017-07-31",10427.33,0.31033899999999998,5.6253039999999999,16.060264,null,"2017-07-31",2.3984519999999998,0.31033899999999998,null,10.27631,5.6253039999999999,null,23.183600999999999,16.060264]
["2017-07-28",82.36,2.3741449999999999,10.195344,21.409134999999999,null,"2017-07-28",10423.049999999999,0.31278400000000001,5.5819489999999998,14.833793,null,"2017-07-28",2.3741449999999999,0.31278400000000001,null,10.195344,5.5819489999999998,null,21.409134999999999,14.833793]
["2017-07-27",83.08,2.189422,11.382223,22.859752,null,"2017-07-27",10508.37,-3.5103000000000002E-2,6.5690600000000003,15.943040999999999,null,"2017-07-27",2.189422,-3.5103000000000002E-2,null,11.382223,6.5690600000000003,null,22.859752,15.943040999999999]
["2017-07-26",82.21,0.77224800000000005,10.289777000000001,22.253632,null,"2017-07-26",10419.11,-0.90213399999999999,5.7085460000000001,15.449889000000001,null,"2017-07-26",0.77224800000000005,-0.90213399999999999,null,10.289777000000001,5.7085460000000001,null,22.253632,15.449889000000001]
["2017-07-25",82.61,3.6902219999999999,10.707585,23.539922000000001,null,"2017-07-25",10463.15,0.82340000000000002,6.3143500000000001,16.364923999999998,null,"2017-07-25",3.6902219999999999,0.82340000000000002,null,10.707585,6.3143500000000001,null,23.539922000000001,16.364923999999998]
["2017-07-24",82.6,3.67767,12.091193000000001,23.489322999999999,null,"2017-07-24",10461.280000000001,0.80538100000000001,7.6490410000000004,16.066987000000001,null,"2017-07-24",3.67767,0.80538100000000001,null,12.091193000000001,7.6490410000000004,null,23.489322999999999,16.066987000000001]
["2017-07-21",82.31,3.7695409999999998,11.849436000000001,22.297032999999999,null,"2017-07-21",10436.700000000001,0.84040899999999996,7.402075,15.239119000000001,null,"2017-07-21",3.7695409999999998,0.84040899999999996,null,11.849436000000001,7.402075,null,22.297032999999999,15.239119000000001]
["2017-07-20",82.92,4.4200980000000003,13.822924,24.218643,null,"2017-07-20",10499.36,1.694035,8.9971750000000004,16.560091,null,"2017-07-20",4.4200980000000003,1.694035,null,13.822924,8.9971750000000004,null,24.218643,16.560091]
["2017-07-19",82.96,5.789339,13.909103,23.741879000000001,null,"2017-07-19",10506.1,2.492537,8.9851179999999999,16.283909000000001,null,"2017-07-19",5.789339,2.492537,null,13.909103,8.9851179999999999,null,23.741879000000001,16.283909000000001]
["2017-07-18",82.67,6.5884479999999996,12.277604,23.862036,null,"2017-07-18",10481.26,3.1952210000000001,7.5380440000000002,16.352305000000001,null,"2017-07-18",6.5884479999999996,3.1952210000000001,null,12.277604,7.5380440000000002,null,23.862036,16.352305000000001]
["2017-07-17",82.31,6.1242910000000004,11.834239,24.293137000000002,null,"2017-07-17",10457.540000000001,2.9616820000000001,7.6277220000000003,16.845980999999998,null,"2017-07-17",6.1242910000000004,2.9616820000000001,null,11.834239,7.6277220000000003,null,24.293137000000002,16.845980999999998]
["2017-07-14",82.14,6.9113629999999997,11.421595,25.48105,null,"2017-07-14",10443.91,3.6877779999999998,7.3048919999999997,17.792532999999999,null,"2017-07-14",6.9113629999999997,3.6877779999999998,null,11.421595,7.3048919999999997,null,25.48105,17.792532999999999]
["2017-07-13",82.39,6.9444439999999998,10.843536,26.048793,null,"2017-07-13",10460.15,3.2779929999999999,6.3382160000000001,18.090373,null,"2017-07-13",6.9444439999999998,3.2779929999999999,null,10.843536,6.3382160000000001,null,26.048793,18.090373]
["2017-07-12",81.66,6.2589459999999999,10.08358,25.079702000000001,null,"2017-07-12",10420.68,3.0734050000000002,6.1419810000000004,17.861529999999998,null,"2017-07-12",6.2589459999999999,3.0734050000000002,null,10.08358,6.1419810000000004,null,25.079702000000001,17.861529999999998]
["2017-07-11",81.650000000000006,4.9216139999999999,10.099784,26.164712999999999,null,"2017-07-11",10415.57,2.1169349999999998,5.9308899999999998,18.541007,null,"2017-07-11",4.9216139999999999,2.1169349999999998,null,10.099784,5.9308899999999998,null,26.164712999999999,18.541007]
["2017-07-10",80.13,2.9683890000000002,7.8756060000000003,26.533109,null,"2017-07-10",10289.91,0.88493200000000005,4.1221180000000004,19.083638000000001,null,"2017-07-10",2.9683890000000002,0.88493200000000005,null,7.8756060000000003,4.1221180000000004,null,26.533109,19.083638000000001]
["2017-07-07",80.040000000000006,2.747112,7.8560840000000001,26.390989999999999,null,"2017-07-07",10297.25,0.854653,4.293164,19.168583000000002,null,"2017-07-07",2.747112,0.854653,null,7.8560840000000001,4.293164,null,26.390989999999999,19.168583000000002]
["2017-07-06",80.64,3.7170420000000002,8.2416110000000007,28.691652999999999,null,"2017-07-06",10368.200000000001,1.5874699999999999,4.7525709999999997,20.901378999999999,null,"2017-07-06",3.7170420000000002,1.5874699999999999,null,8.2416110000000007,4.7525709999999997,null,28.691652999999999,20.901378999999999]
["2017-07-05",80.81,3.589283,7.7323019999999998,26.699417,null,"2017-07-05",10404.790000000001,1.740029,4.576219,19.374787000000001,null,"2017-07-05",3.589283,1.740029,null,7.7323019999999998,4.576219,null,26.699417,19.374787000000001]
["2017-07-04",80.09,3.5691190000000002,8.8623080000000005,24.646407,null,"2017-07-04",10347.780000000001,1.8667769999999999,5.4656159999999998,18.117522000000001,null,"2017-07-04",3.5691190000000002,1.8667769999999999,null,8.8623080000000005,5.4656159999999998,null,24.646407,18.117522000000001]
["2017-07-03",80.760000000000005,4.4355359999999999,9.7730049999999995,26.200927,null,"2017-07-03",10412.790000000001,2.5067560000000002,6.1282040000000002,19.16347,null,"2017-07-03",4.4355359999999999,2.5067560000000002,null,9.7730049999999995,6.1282040000000002,null,26.200927,19.16347]
["2017-06-30",80.489999999999995,5.5329750000000004,9.4060079999999999,27.140335,null,"2017-06-30",10395.07,3.5291290000000002,5.9476000000000004,19.944315,null,"2017-06-30",5.5329750000000004,3.5291290000000002,null,9.4060079999999999,5.9476000000000004,null,27.140335,19.944315]
["2017-06-29",80.86,4.931222,9.0786460000000009,29.341548,null,"2017-06-29",10421.65,3.164736,5.7364620000000004,21.371655000000001,null,"2017-06-29",4.931222,3.164736,null,9.0786460000000009,5.7364620000000004,null,29.341548,21.371655000000001]
["2017-06-28",80.45,4.3991689999999997,7.9575950000000004,30.152398999999999,null,"2017-06-28",10390.549999999999,2.8568739999999999,5.2053120000000002,22.162575,null,"2017-06-28",4.3991689999999997,2.8568739999999999,null,7.9575950000000004,5.2053120000000002,null,30.152398999999999,22.162575]
["2017-06-27",81.3,5.5022060000000002,9.2888830000000002,32.291747999999998,null,"2017-06-27",10512.06,4.0597110000000001,6.4321640000000002,24.272627,null,"2017-06-27",5.5022060000000002,4.0597110000000001,null,9.2888830000000002,6.4321640000000002,null,32.291747999999998,24.272627]
["2017-06-26",81.58,5.8655590000000002,9.7538009999999993,33.565368999999997,null,"2017-06-26",10513.96,4.078519,6.1696580000000001,24.029402000000001,null,"2017-06-26",5.8655590000000002,4.078519,null,9.7538009999999993,6.1696580000000001,null,33.565368999999997,24.029402000000001]
["2017-06-23",79.67,4.4304629999999996,6.8248860000000002,27.339769,null,"2017-06-23",10377.700000000001,3.695703,4.5007720000000004,19.604503000000001,null,"2017-06-23",4.4304629999999996,3.695703,null,6.8248860000000002,4.5007720000000004,null,27.339769,19.604503000000001]
["2017-06-22",79.790000000000006,4.7525269999999997,7.0001340000000001,26.944137999999999,null,"2017-06-22",10399.06,4.019101,4.801132,19.306583,null,"2017-06-22",4.7525269999999997,4.019101,null,7.0001340000000001,4.801132,null,26.944137999999999,19.306583]
["2017-06-21",79.319999999999993,4.6852320000000001,5.68954,26.643606999999999,null,"2017-06-21",10349.719999999999,4.042173,3.7827060000000001,19.169819,null,"2017-06-21",4.6852320000000001,4.042173,null,5.68954,3.7827060000000001,null,26.643606999999999,19.169819]
["2017-06-20",79.41,4.8040120000000002,6.7912860000000004,27.712183,null,"2017-06-20",10324.459999999999,3.788243,4.1510259999999999,19.691116999999998,null,"2017-06-20",4.8040120000000002,3.788243,null,6.7912860000000004,4.1510259999999999,null,27.712183,19.691116999999998]
["2017-06-19",78.42,3.4974259999999999,5.4599250000000001,26.927706000000001,null,"2017-06-19",10250.6,3.0457540000000001,3.4506070000000002,19.637072,null,"2017-06-19",3.4974259999999999,3.0457540000000001,null,5.4599250000000001,3.4506070000000002,null,26.927706000000001,19.637072]
["2017-06-16",77.56,1.385621,4.9952620000000003,26.863427999999999,null,"2017-06-16",10156.73,1.2484690000000001,3.2415690000000001,19.573376,null,"2017-06-16",1.385621,1.2484690000000001,null,4.9952620000000003,3.2415690000000001,null,26.863427999999999,19.573376]
["2017-06-15",76.97,0.50927100000000003,5.4672510000000001,23.864919,null,"2017-06-15",10088.35,0.51341000000000003,3.5731920000000001,17.219570999999998,null,"2017-06-15",0.50927100000000003,0.51341000000000003,null,5.4672510000000001,3.5731920000000001,null,23.864919,17.219570999999998]
["2017-06-14",76.83,0.773872,5.3042759999999998,24.179618000000001,null,"2017-06-14",10072.459999999999,0.85753000000000001,3.3686669999999999,17.447749999999999,null,"2017-06-14",{"$f":"IF(ISERROR(VLOOKUP($M67,XX_TEJ6,3,FALSE)=TRUE),\"\",VLOOKUP($M67,XX_TEJ6,3,FALSE))","v":0.773872},{"$f":"IF(ISERROR(VLOOKUP($M67,XX_TEJ7,3,FALSE)=TRUE),\"\",VLOOKUP($M67,XX_TEJ7,3,FALSE))","v":0.85753000000000001},null,{"$f":"IF(ISERROR(VLOOKUP($M67,XX_TEJ6,4,FALSE)=TRUE),\"\",VLOOKUP($M67,XX_TEJ6,4,FALSE))","v":5.3042759999999998},{"$f":"IF(ISERROR(VLOOKUP($M67,XX_TEJ7,4,FALSE)=TRUE),\"\",VLOOKUP($M67,XX_TEJ7,4,FALSE))","v":3.3686669999999999},null,{"$f":"IF(ISERROR(VLOOKUP($M67,XX_TEJ6,5,FALSE)=TRUE),\"\",VLOOKUP($M67,XX_TEJ6,5,FALSE))","v":24.179618000000001},{"$f":"IF(ISERROR(VLOOKUP($M67,XX_TEJ7,5,FALSE)=TRUE),\"\",VLOOKUP($M67,XX_TEJ7,5,FALSE))","v":17.447749999999999}]
["2017-06-13",77.040000000000006,1.049318,5.9988989999999998,25.182932000000001,null,"2017-06-13",10128.15,1.415165,4.442558,18.649121000000001,null,{"$f":"IF($A68=\"\",\"\",$A68)","v":"2017-06-13"},1.049318,1.415165,null,5.9988989999999998,4.442558,null,25.182932000000001,18.649121000000001]
["2017-06-12",76.849999999999994,0.80010499999999996,6.691656,21.985719,null,"2017-06-12",10109.959999999999,1.233025,5.0070160000000001,16.000036999999999,null,"2017-06-12",0.80010499999999996,1.233025,null,6.691656,5.0070160000000001,null,21.985719,16.000036999999999]
["2017-06-09",77.819999999999993,2.4351720000000001,7.8287380000000004,23.525421000000001,null,"2017-06-09",10199.65,2.865923,5.6016339999999998,17.029125000000001,null,"2017-06-09",2.4351720000000001,2.865923,null,7.8287380000000004,5.6016339999999998,null,23.525421000000001,17.029125000000001]
["2017-06-08",78.02,2.9016090000000001,6.9353069999999999,23.842886,null,"2017-06-08",10225.780000000001,2.9035199999999999,4.8426970000000003,17.328937,null,"2017-06-08",2.9016090000000001,2.9035199999999999,null,6.9353069999999999,4.8426970000000003,null,23.842886,17.328937]
["2017-06-07",77.900000000000006,3.604203,7.0349000000000004,24.453116000000001,null,"2017-06-07",10209.99,3.131837,4.8461350000000003,17.627967999999999,null,"2017-06-07",3.604203,3.131837,null,7.0349000000000004,4.8461350000000003,null,24.453116000000001,17.627967999999999]
["2017-06-06",77.75,3.4047079999999998,7.4934329999999996,25.588246999999999,null,"2017-06-06",10206.18,3.0933519999999999,5.4071049999999996,18.716405999999999,null,"2017-06-06",3.4047079999999998,3.0933519999999999,null,7.4934329999999996,5.4071049999999996,null,25.588246999999999,18.716405999999999]
["2017-06-05",78.010000000000005,3.750499,8.1519480000000009,26.343035,null,"2017-06-05",10226.84,3.3020399999999999,5.9972779999999997,19.033425000000001,null,"2017-06-05",3.750499,3.3020399999999999,null,8.1519480000000009,5.9972779999999997,null,26.343035,19.033425000000001]
["2017-06-03",77.33,2.1937359999999999,7.209206,25.104848,null,"2017-06-03",10158.15,2.0373009999999998,5.2853329999999996,18.291885000000001,null,"2017-06-03",2.1937359999999999,2.0373009999999998,null,7.209206,5.2853329999999996,null,25.104848,18.291885000000001]
["2017-06-02",77.349999999999994,2.6134249999999999,6.4840309999999999,26.002797000000001,null,"2017-06-02",10152.530000000001,2.1250810000000002,4.7538130000000001,18.659493999999999,null,"2017-06-02",2.6134249999999999,2.1250810000000002,null,6.4840309999999999,4.7538130000000001,null,26.002797000000001,18.659493999999999]
["2017-06-01",76.81,2.7696010000000002,6.0325790000000001,24.535799000000001,null,"2017-06-01",10087.42,2.182131,4.26511,17.334329,null,"2017-06-01",2.7696010000000002,2.182131,null,6.0325790000000001,4.26511,null,24.535799000000001,17.334329]
["2017-05-31",76.27,2.0470969999999999,4.1939890000000002,24.773095999999999,null,"2017-05-31",10040.719999999999,1.709076,2.9767800000000002,17.633579000000001,null,"2017-05-31",2.0470969999999999,1.709076,null,4.1939890000000002,2.9767800000000002,null,24.773095999999999,17.633579000000001]
["2017-05-26",77.06,3.380735,5.2732239999999999,28.499967999999999,null,"2017-05-26",10101.950000000001,2.4907550000000001,3.604749,20.345551,null,"2017-05-26",3.380735,2.4907550000000001,null,5.2732239999999999,3.604749,null,28.499967999999999,20.345551]
["2017-05-25",77.09,3.3101050000000001,5.3142079999999998,28.425989999999999,null,"2017-05-25",10108.49,2.7107079999999999,3.6718229999999998,20.393630000000002,null,"2017-05-25",3.3101050000000001,2.7107079999999999,null,5.3142079999999998,3.6718229999999998,null,28.425989999999999,20.393630000000002]
["2017-05-24",76.5,3.813272,4.508197,29.272024999999999,null,"2017-05-24",10044.42,3.3594529999999998,3.014726,21.007486,null,"2017-05-24",3.813272,3.3594529999999998,null,4.508197,3.014726,null,29.272024999999999,21.007486]
["2017-05-23",76.290000000000006,3.6689769999999999,4.0223620000000002,27.853797,null,"2017-05-23",10007.84,2.9887589999999999,2.4416259999999999,19.934232000000002,null,"2017-05-23",3.6689769999999999,2.9887589999999999,null,4.0223620000000002,2.4416259999999999,null,27.853797,19.934232000000002]
["2017-05-22",76.17,3.5059110000000002,3.787982,31.546097,null,"2017-05-22",9997.26,2.879883,2.234226,22.948473,null,"2017-05-22",3.5059110000000002,2.879883,null,3.787982,2.234226,null,31.546097,22.948473]
["2017-05-19",75.77,4.0367980000000001,3.1164939999999999,31.601033999999999,null,"2017-05-19",9947.6200000000008,3.1917209999999998,1.7147380000000001,22.871103999999999,null,"2017-05-19",4.0367980000000001,3.1917209999999998,null,3.1164939999999999,1.7147380000000001,null,31.601033999999999,22.871103999999999]
["2017-05-18",76.010000000000005,3.2323780000000002,3.443114,30.985973000000001,null,"2017-05-18",9969.4500000000007,2.2868580000000001,1.9379500000000001,22.179424000000001,null,"2017-05-18",3.2323780000000002,2.2868580000000001,null,3.443114,1.9379500000000001,null,30.985973000000001,22.179424000000001]
["2017-05-17",76.37,3.7635869999999998,3.9330430000000001,31.935476999999999,null,"2017-05-17",10013.67,3.059466,2.6016010000000001,23.010805000000001,null,"2017-05-17",3.7635869999999998,3.059466,null,3.9330430000000001,2.6016010000000001,null,31.935476999999999,23.010805000000001]
["2017-05-16",76.5,3.771026,3.855553,33.315852,null,"2017-05-16",10031.49,3.0675240000000001,2.6633239999999998,24.342927,null,"2017-05-16",3.771026,3.0675240000000001,null,3.855553,2.6633239999999998,null,33.315852,24.342927]
["2017-05-15",76.58,3.8795440000000001,3.626522,33.725147,null,"2017-05-15",10036.82,3.122287,2.4190390000000002,24.623868000000002,null,"2017-05-15",3.8795440000000001,3.122287,null,3.626522,2.4190390000000002,null,33.725147,24.623868000000002]
["2017-05-12",76.239999999999995,2.7770290000000002,4.6103180000000004,32.262168000000003,null,"2017-05-12",9986.82,1.72281,3.323439,23.171662999999999,null,"2017-05-12",2.7770290000000002,1.72281,null,4.6103180000000004,3.323439,null,32.262168000000003,23.171662999999999]
["2017-05-11",76.59,3.2766989999999998,5.09056,32.625107,null,"2017-05-11",10001.48,1.719414,3.4751110000000001,22.935359999999999,null,"2017-05-11",3.2766989999999998,1.719414,null,5.09056,3.4751110000000001,null,32.625107,22.935359999999999]
["2017-05-10",76.209999999999994,2.5982769999999999,4.5691550000000003,31.834902,null,"2017-05-10",9968.32,0.86799499999999996,3.1320380000000001,22.216351,null,"2017-05-10",2.5982769999999999,0.86799499999999996,null,4.5691550000000003,3.1320380000000001,null,31.834902,22.216351]
["2017-05-09",75.97,2.371648,5.3091210000000002,31.882086999999999,null,"2017-05-09",9915.48,0.42650100000000002,3.3920110000000001,21.934176999999998,null,"2017-05-09",2.371648,0.42650100000000002,null,5.3091210000000002,3.3920110000000001,null,31.882086999999999,21.934176999999998]
["2017-05-08",75.819999999999993,2.1695190000000002,5.6577479999999998,31.533546000000001,null,"2017-05-08",9937.25,0.64699300000000004,4.1285730000000003,21.982880999999999,null,"2017-05-08",2.1695190000000002,0.64699300000000004,null,5.6577479999999998,4.1285730000000003,null,31.533546000000001,21.982880999999999]
["2017-05-05",75.19,0.23996799999999999,5.5934249999999999,30.027000000000001,null,"2017-05-05",9899.94,-0.497915,4.6996690000000001,21.204560000000001,null,"2017-05-05",0.23996799999999999,-0.497915,null,5.5934249999999999,4.6996690000000001,null,30.027000000000001,21.204560000000001]
["2017-05-04",75.680000000000007,2.868017,6.2815580000000004,30.504107999999999,null,"2017-05-04",9967.64,1.591191,5.4156500000000003,21.772359999999999,null,"2017-05-04",2.868017,1.591191,null,6.2815580000000004,5.4156500000000003,null,30.504107999999999,21.772359999999999]
["2017-05-03",75.67,2.8544239999999999,6.2675150000000004,28.793621000000002,null,"2017-05-03",9955.33,1.4657260000000001,5.2854619999999999,20.028766999999998,null,"2017-05-03",2.8544239999999999,1.4657260000000001,null,6.2675150000000004,5.2854619999999999,null,28.793621000000002,20.028766999999998]
["2017-05-02",75.38,2.460242,5.9329179999999999,26.635954999999999,null,"2017-05-02",9941.27,1.322425,5.4332549999999999,18.660643,null,"2017-05-02",2.460242,1.322425,null,5.9329179999999999,5.4332549999999999,null,26.635954999999999,18.660643]
["2017-04-28",74.739999999999995,1.590322,4.5455199999999998,25.560776000000001,null,"2017-04-28",9872,0.61641800000000002,4.4882749999999998,17.833825000000001,null,"2017-04-28",1.590322,0.61641800000000002,null,4.5455199999999998,4.4882749999999998,null,25.560776000000001,17.833825000000001]
["2017-04-27",74.59,0.26885300000000001,4.3357020000000004,22.005455999999999,null,"2017-04-27",9860.6200000000008,-0.16351499999999999,4.367826,15.153129,null,"2017-04-27",0.26885300000000001,-0.16351499999999999,null,4.3357020000000004,4.367826,null,22.005455999999999,15.153129]
["2017-04-26",74.540000000000006,0.282524,4.2657619999999996,21.578223999999999,null,"2017-04-26",9856.4500000000007,-0.46985900000000003,4.3236889999999999,14.856023,null,"2017-04-26",0.282524,-0.46985900000000003,null,4.2657619999999996,4.3236889999999999,null,21.578223999999999,14.856023]
["2017-04-25",74.62,0.390152,4.3776659999999996,22.016005,null,"2017-04-25",9841.7099999999991,-0.618703,4.1676770000000003,14.969487000000001,null,"2017-04-25",0.390152,-0.618703,null,4.3776659999999996,4.1676770000000003,null,22.016005,14.969487000000001]
["2017-04-24",73.69,-0.86102500000000004,3.0767910000000001,20.800304000000001,null,"2017-04-24",9717.9500000000007,-1.8684270000000001,2.8577629999999998,13.849983999999999,null,"2017-04-24",-0.86102500000000004,-1.8684270000000001,null,3.0767910000000001,2.8577629999999998,null,20.800304000000001,13.849983999999999]
["2017-04-21",73.59,-1.94537,4.3485699999999996,20.445824999999999,null,"2017-04-21",9717.41,-2.5578370000000001,4.1360089999999996,13.406546000000001,null,"2017-04-21",-1.94537,-2.5578370000000001,null,4.3485699999999996,4.1360089999999996,null,20.445824999999999,13.406546000000001]
["2017-04-20",72.849999999999994,-2.030662,3.2992710000000001,20.337097,null,"2017-04-20",9632.69,-2.827407,3.2281119999999999,13.133039,null,"2017-04-20",-2.030662,-2.827407,null,3.2992710000000001,3.2281119999999999,null,20.337097,13.133039]
["2017-04-19",72.83,-2.0575580000000002,3.4715760000000002,18.453519,null,"2017-04-19",9639.94,-2.7122660000000001,3.4537010000000001,11.654536,null,"2017-04-19",-2.0575580000000002,-2.7122660000000001,null,3.4715760000000002,3.4537010000000001,null,18.453519,11.654536]
["2017-04-18",73.63,-0.981711,4.3185849999999997,19.063203000000001,null,"2017-04-18",9746.56,-1.6362410000000001,4.3308850000000003,12.468828999999999,null,"2017-04-18",-0.981711,-1.6362410000000001,null,4.3185849999999997,4.3308850000000003,null,19.063203000000001,12.468828999999999]
["2017-04-17",73.599999999999994,-1.0220549999999999,3.8592070000000001,18.460103,null,"2017-04-17",9716.4,-1.94062,3.8683930000000002,11.677752,null,"2017-04-17",-1.0220549999999999,-1.94062,null,3.8592070000000001,3.8683930000000002,null,18.460103,11.677752]
["2017-04-14",73.72,1.0416669999999999,3.6854969999999998,18.948861000000001,null,"2017-04-14",9732.93,-0.115761,3.7755239999999999,12.289521000000001,null,"2017-04-14",1.0416669999999999,-0.115761,null,3.6854969999999998,3.7755239999999999,null,18.948861000000001,12.289521000000001]
["2017-04-13",74.33,2.2702260000000001,4.5434489999999998,20.101424000000002,null,"2017-04-13",9836.68,1.4368890000000001,4.8817389999999996,13.691504999999999,null,"2017-04-13",2.2702260000000001,1.4368890000000001,null,4.5434489999999998,4.8817389999999996,null,20.101424000000002,13.691504999999999]
["2017-04-12",74.180000000000007,2.9848669999999999,3.8189449999999998,21.854172999999999,null,"2017-04-12",9817.68,1.971252,4.3304169999999997,15.079977,null,"2017-04-12",2.9848669999999999,1.971252,null,3.8189449999999998,4.3304169999999997,null,21.854172999999999,15.079977]
["2017-04-11",74.16,2.9571010000000002,4.7505230000000003,21.590012999999999,null,"2017-04-11",9832.42,2.124349,5.2075060000000004,14.829976,null,"2017-04-11",2.9571010000000002,2.124349,null,4.7505230000000003,5.2075060000000004,null,21.590012999999999,14.829976]
["2017-04-10",74.28,3.1236980000000001,4.7177249999999997,22.231591000000002,null,"2017-04-10",9882.5400000000009,2.6449199999999999,5.6996849999999997,15.700286999999999,null,"2017-04-10",3.1236980000000001,2.6449199999999999,null,4.7177249999999997,5.6996849999999997,null,22.231591000000002,15.700286999999999]
["2017-04-07",74.209999999999994,1.964826,4.4177119999999999,23.212143000000001,null,"2017-04-07",9873.3700000000008,1.389392,5.3471859999999998,16.290686000000001,null,"2017-04-07",1.964826,1.389392,null,4.4177119999999999,5.3471859999999998,null,23.212143000000001,16.290686000000001]
["2017-04-06",74.5,3.0001380000000002,4.8257589999999997,23.476004,null,"2017-04-06",9897.7999999999993,2.2222270000000002,5.60785,16.262789000000001,null,"2017-04-06",3.0001380000000002,2.2222270000000002,null,4.8257589999999997,5.60785,null,23.476004,16.262789000000001]
["2017-04-05",75.010000000000005,3.992791,5.7905660000000001,21.541301000000001,null,"2017-04-05",9949.48,3.1225480000000001,6.3189909999999996,14.922582,null,"2017-04-05",3.992791,3.1225480000000001,null,5.7905660000000001,6.3189909999999996,null,21.541301000000001,14.922582]
["2017-03-31",73.569999999999993,0.50546400000000002,4.9306950000000001,17.444966999999998,null,"2017-03-31",9811.52,0.62612400000000001,6.030367,12.197950000000001,null,"2017-03-31",0.50546400000000002,0.62612400000000001,null,4.9306950000000001,6.030367,null,17.444966999999998,12.197950000000001]
["2017-03-30",73.97,1.0519130000000001,5.5012030000000003,18.320484,null,"2017-03-30",9848.15,1.001798,6.4262170000000003,12.717236,null,"2017-03-30",1.0519130000000001,1.001798,null,5.5012030000000003,6.4262170000000003,null,18.320484,12.717236]
["2017-03-29",74.13,1.270492,6.8309090000000001,20.341221999999998,null,"2017-03-29",9856.25,1.0848709999999999,7.6822140000000001,14.376810000000001,null,"2017-03-29",1.270492,1.0848709999999999,null,6.8309090000000001,7.6822140000000001,null,20.341221999999998,14.376810000000001]
["2017-03-28",74.52,1.8032790000000001,6.5826640000000003,20.295874000000001,null,"2017-03-28",9876.4500000000007,1.2920400000000001,7.3363839999999998,13.647164,null,"2017-03-28",1.8032790000000001,1.2920400000000001,null,6.5826640000000003,7.3363839999999998,null,20.295874000000001,13.647164]
["2017-03-27",74.39,1.625683,7.5690629999999999,20.254625999999998,null,"2017-03-27",9876.77,1.2953220000000001,8.4254829999999998,13.461276,null,"2017-03-27",1.625683,1.2953220000000001,null,7.5690629999999999,8.4254829999999998,null,20.254625999999998,13.461276]
["2017-03-24",74.33,1.5437160000000001,8.0316939999999999,19.449508000000002,null,"2017-03-24",9902.98,1.56413,9.0799939999999992,13.262606,null,"2017-03-24",1.5437160000000001,1.56413,null,8.0316939999999999,9.0799939999999992,null,19.449508000000002,13.262606]
["2017-03-23",74.58,1.690755,8.3950449999999996,19.554601000000002,null,"2017-03-23",9930.74,1.65242,9.3857669999999995,13.285855,null,"2017-03-23",1.690755,1.65242,null,8.3950449999999996,9.3857669999999995,null,19.554601000000002,13.285855]
["2017-03-22",74.569999999999993,1.6078479999999999,7.9055609999999996,19.52008,null,"2017-03-22",9922.66,1.471349,8.8160109999999996,12.941286,null,"2017-03-22",1.6078479999999999,1.471349,null,7.9055609999999996,8.8160109999999996,null,19.52008,12.941286]
["2017-03-21",75.05,2.1366360000000002,7.5360279999999999,19.78914,null,"2017-03-21",9972.49,2.1360250000000001,8.3464609999999997,13.160439,null,"2017-03-21",2.1366360000000002,2.1360250000000001,null,7.5360279999999999,8.3464609999999997,null,19.78914,13.160439]
["2017-03-20",74.36,1.3493250000000001,5.9098800000000002,18.614730999999999,null,"2017-03-20",9912.9699999999993,1.6381289999999999,7.2552510000000003,12.510456,null,"2017-03-20",1.3493250000000001,1.6381289999999999,null,5.9098800000000002,7.2552510000000003,null,18.614730999999999,12.510456]
["2017-03-17",74.36,1.197605,4.9461339999999998,19.757739000000001,null,"2017-03-17",9908.69,1.52596,6.2391310000000004,13.442608,null,"2017-03-17",1.197605,1.52596,null,4.9461339999999998,6.2391310000000004,null,19.757739000000001,13.442608]
["2017-03-16",73.87,0.28509400000000001,4.2545849999999996,19.900359000000002,null,"2017-03-16",9837.83,0.68138699999999996,5.4793830000000003,13.089684999999999,null,"2017-03-16",0.28509400000000001,0.68138699999999996,null,4.2545849999999996,5.4793830000000003,null,19.900359000000002,13.089684999999999]
["2017-03-15",72.98,-1.244926,2.4335879999999999,19.579644999999999,null,"2017-03-15",9740.31,-0.60664799999999997,4.0592499999999996,13.112373,null,"2017-03-15",-1.244926,-0.60664799999999997,null,2.4335879999999999,4.0592499999999996,null,19.579644999999999,13.112373]
["2017-03-14",72.959999999999994,-0.423093,2.3073190000000001,17.906181,null,"2017-03-14",9744.2099999999991,0.261658,4.0101319999999996,11.389132999999999,null,"2017-03-14",-0.423093,0.261658,null,2.3073190000000001,4.0101319999999996,null,17.906181,11.389132999999999]
["2017-03-13",72.680000000000007,-0.79170099999999999,1.7474369999999999,18.116855000000001,null,"2017-03-13",9697.34,-0.13367200000000001,3.359575,11.385068,null,"2017-03-13",-0.79170099999999999,-0.13367200000000001,null,1.7474369999999999,3.359575,null,18.116855000000001,11.385068]
["2017-03-10",72.03,-1.166301,0.75480100000000006,17.68807,null,"2017-03-10",9627.89,-0.39004299999999997,2.504184,11.167573000000001,null,"2017-03-10",{"$f":"IF(ISERROR(VLOOKUP($M131,XX_TEJ6,3,FALSE)=TRUE),\"\",VLOOKUP($M131,XX_TEJ6,3,FALSE))","v":-1.166301},{"$f":"IF(ISERROR(VLOOKUP($M131,XX_TEJ7,3,FALSE)=TRUE),\"\",VLOOKUP($M131,XX_TEJ7,3,FALSE))","v":-0.39004299999999997},null,{"$f":"IF(ISERROR(VLOOKUP($M131,XX_TEJ6,4,FALSE)=TRUE),\"\",VLOOKUP($M131,XX_TEJ6,4,FALSE))","v":0.75480100000000006},{"$f":"IF(ISERROR(VLOOKUP($M131,XX_TEJ7,4,FALSE)=TRUE),\"\",VLOOKUP($M131,XX_TEJ7,4,FALSE))","v":2.504184},null,{"$f":"IF(ISERROR(VLOOKUP($M131,XX_TEJ6,5,FALSE)=TRUE),\"\",VLOOKUP($M131,XX_TEJ6,5,FALSE))","v":17.68807},{"$f":"IF(ISERROR(VLOOKUP($M131,XX_TEJ7,5,FALSE)=TRUE),\"\",VLOOKUP($M131,XX_TEJ7,5,FALSE))","v":11.167573000000001}]
["2017-03-09",72.17,4.1585999999999998E-2,0.95063200000000003,18.383476999999999,null,"2017-03-09",9658.61,0.71354200000000001,2.8312469999999998,11.865728000000001,null,{"$f":"IF($A132=\"\",\"\",$A132)","v":"2017-03-09"},4.1585999999999998E-2,0.71354200000000001,null,0.95063200000000003,2.8312469999999998,null,18.383476999999999,11.865728000000001]
["2017-03-08",72.959999999999994,1.6722410000000001,2.2233000000000001,19.245179,null,"2017-03-08",9753.4500000000007,2.202604,4.0272569999999996,12.570418,null,"2017-03-08",1.6722410000000001,2.202604,null,2.2233000000000001,4.0272569999999996,null,19.245179,12.570418]
["2017-03-07",72.78,1.1817040000000001,3.5298620000000001,19.176559000000001,null,"2017-03-07",9738.07,1.9206540000000001,5.1185840000000002,12.454689,null,"2017-03-07",1.1817040000000001,1.9206540000000001,null,3.5298620000000001,5.1185840000000002,null,19.176559000000001,12.454689]
["2017-03-06",72.33,0.87119000000000002,2.9899200000000001,18.383565000000001,null,"2017-03-06",9682.6299999999992,1.516249,4.6683680000000001,12.02145,null,"2017-03-06",0.87119000000000002,1.516249,null,2.9899200000000001,4.6683680000000001,null,18.383565000000001,12.02145]
["2017-03-03",72.13,1.2960989999999999,3.6422330000000001,18.224287,null,"2017-03-03",9648.2099999999991,2.037426,4.9917899999999999,12.034896,null,"2017-03-03",1.2960989999999999,2.037426,null,3.6422330000000001,4.9917899999999999,null,18.224287,12.034896]
["2017-03-02",72.64,2.0823450000000001,4.3750419999999997,20.373994,null,"2017-03-02",9691.7999999999993,2.7874729999999999,5.4661359999999997,13.433325,null,"2017-03-02",2.0823450000000001,2.7874729999999999,null,4.3750419999999997,5.4661359999999997,null,20.373994,13.433325]
["2017-03-01",72.44,1.3283050000000001,3.003269,21.088267999999999,null,"2017-03-01",9674.7800000000007,2.4008379999999998,4.4394520000000002,14.012885000000001,null,"2017-03-01",1.3283050000000001,2.4008379999999998,null,3.003269,4.4394520000000002,null,21.088267999999999,14.012885000000001]
["2017-02-24",73.2,2.3913850000000001,4.3302909999999999,23.333549000000001,null,"2017-02-24",9750.4699999999993,3.2019639999999998,5.5164590000000002,15.923012,null,"2017-02-24",2.3913850000000001,3.2019639999999998,null,4.3302909999999999,5.5164590000000002,null,23.333549000000001,15.923012]
["2017-02-23",73.34,2.7416510000000001,4.6463950000000001,24.766378,null,"2017-02-23",9769.31,3.663605,6.4400219999999999,17.213341,null,"2017-02-23",2.7416510000000001,3.663605,null,4.6463950000000001,6.4400219999999999,null,24.766378,17.213341]
["2017-02-22",73.39,4.0649749999999996,5.3196490000000001,24.667231999999998,null,"2017-02-22",9778.7800000000007,4.7936759999999996,7.0662700000000003,17.439122999999999,null,"2017-02-22",4.0649749999999996,4.7936759999999996,null,5.3196490000000001,7.0662700000000003,null,24.667231999999998,17.439122999999999]
["2017-02-21",73.48,4.1925929999999996,6.6297600000000001,24.779202999999999,null,"2017-02-21",9763.93,4.6345369999999999,7.994815,17.283881000000001,null,"2017-02-21",4.1925929999999996,4.6345369999999999,null,6.6297600000000001,7.994815,null,24.779202999999999,17.283881000000001]
["2017-02-20",73.37,4.0366160000000004,6.7576869999999998,24.592407999999999,null,"2017-02-20",9753.2000000000007,4.5195499999999997,8.2631519999999998,17.154993000000001,null,"2017-02-20",4.0366160000000004,4.5195499999999997,null,6.7576869999999998,8.2631519999999998,null,24.592407999999999,17.154993000000001]
["2017-02-18",73.48,4.1060660000000002,6.9177439999999999,24.738319000000001,null,"2017-02-18",9779.92,4.687983,8.5597510000000003,17.622467,null,"2017-02-18",4.1060660000000002,4.687983,null,6.9177439999999999,8.5597510000000003,null,24.738319000000001,17.622467]
["2017-02-17",73.48,3.6898719999999998,6.8721690000000004,26.541913999999998,null,"2017-02-17",9759.76,4.331912,8.4989209999999993,18.814986000000001,null,"2017-02-17",3.6898719999999998,4.331912,null,6.8721690000000004,8.4989209999999993,null,26.541913999999998,18.814986000000001]
["2017-02-16",73.66,4.6507800000000001,7.7463379999999997,26.809746000000001,null,"2017-02-16",9771.25,5.1539279999999996,9.0271159999999995,18.986443000000001,null,"2017-02-16",4.6507800000000001,5.1539279999999996,null,7.7463379999999997,9.0271159999999995,null,26.809746000000001,18.986443000000001]
["2017-02-15",73.900000000000006,3.938663,8.4538480000000007,29.921064000000001,null,"2017-02-15",9799.76,4.488086,9.7270979999999998,21.486988,null,"2017-02-15",3.938663,4.488086,null,8.4538480000000007,9.7270979999999998,null,29.921064000000001,21.486988]
["2017-02-14",73.27,3.0525829999999998,7.313879,28.551755,null,"2017-02-14",9718.7800000000007,3.6246529999999999,8.7063220000000001,20.535533000000001,null,"2017-02-14",3.0525829999999998,3.6246529999999999,null,7.313879,8.7063220000000001,null,28.551755,20.535533000000001]
["2017-02-13",73.260000000000005,3.0385179999999998,7.1153170000000001,28.534210999999999,null,"2017-02-13",9710.32,3.534449,8.4012069999999994,20.430609,null,"2017-02-13",3.0385179999999998,3.534449,null,7.1153170000000001,8.4012069999999994,null,28.534210999999999,20.430609]
["2017-02-10",72.88,2.7440470000000001,4.0625640000000001,27.867502999999999,null,"2017-02-10",9665.59,3.3792740000000001,5.6097020000000004,19.875852999999999,null,"2017-02-10",2.7440470000000001,3.3792740000000001,null,4.0625640000000001,5.6097020000000004,null,27.867502999999999,19.875852999999999]
["2017-02-09",72.14,1.7708969999999999,5.2672319999999999,26.569178000000001,null,"2017-02-09",9590.18,2.6519900000000001,7.2343229999999998,18.940593,null,"2017-02-09",1.7708969999999999,2.6519900000000001,null,5.2672319999999999,7.2343229999999998,null,26.569178000000001,18.940593]
["2017-02-08",71.760000000000005,0.97042200000000001,1.5426899999999999,25.902470000000001,null,"2017-02-08",9543.25,1.8248610000000001,3.5348250000000001,18.358550999999999,null,"2017-02-08",0.97042200000000001,1.8248610000000001,null,1.5426899999999999,3.5348250000000001,null,25.902470000000001,18.358550999999999]
["2017-02-07",73.63,1.209622,2.0937329999999998,26.200734000000001,null,"2017-02-07",9554.56,1.9455370000000001,3.968731,18.498822000000001,null,"2017-02-07",1.209622,1.9455370000000001,null,2.0937329999999998,3.968731,null,26.200734000000001,18.498822000000001]
["2017-02-06",73.400000000000006,0.89347100000000002,3.2929919999999999,25.806516999999999,null,"2017-02-06",9538.01,1.7689509999999999,5.181432,18.293562999999999,null,"2017-02-06",0.89347100000000002,1.7689509999999999,null,3.2929919999999999,5.181432,null,25.806516999999999,18.293562999999999]
["2017-02-03",72.89,1.1939470000000001,2.5897260000000002,24.932385,null,"2017-02-03",9455.56,1.970046,4.2823250000000002,17.270990999999999,null,"2017-02-03",1.1939470000000001,1.970046,null,2.5897260000000002,4.2823250000000002,null,24.932385,17.270990999999999]
["2017-02-02",72.84,1.490874,1.746054,24.027674000000001,null,"2017-02-02",9428.9699999999993,1.896255,3.172434,15.959804,null,"2017-02-02",1.490874,1.896255,null,1.746054,3.172434,null,24.027674000000001,15.959804]
["2017-01-24",73.180000000000007,1.964609,0.74339200000000005,24.313856999999999,null,"2017-01-24",9447.9500000000007,2.1013670000000002,1.6989019999999999,15.99394,null,"2017-01-24",1.964609,2.1013670000000002,null,0.74339200000000005,1.6989019999999999,null,24.313856999999999,15.99394]
["2017-01-23",73.069999999999993,3.7484030000000002,0.53659900000000005,30.638072999999999,null,"2017-01-23",9424.0499999999993,3.8046449999999998,1.2623340000000001,21.503755999999999,null,"2017-01-23",3.7484030000000002,3.8046449999999998,null,0.53659900000000005,1.2623340000000001,null,30.638072999999999,21.503755999999999]
["2017-01-20",72.19,0.44524799999999998,-0.91957199999999994,30.540319,null,"2017-01-20",9331.4599999999991,0.96349300000000004,0.15262000000000001,21.201644000000002,null,"2017-01-20",0.44524799999999998,0.96349300000000004,null,-0.91957199999999994,0.15262000000000001,null,30.540319,21.201644000000002]
["2017-01-19",72.05,0.33421499999999998,-0.77124400000000004,27.419203,null,"2017-01-19",9318.1200000000008,0.852877,0.367622,18.628419999999998,null,"2017-01-19",0.33421499999999998,0.852877,null,-0.77124400000000004,0.367622,null,27.419203,18.628419999999998]
["2017-01-18",72.25,-0.38604699999999997,0.36116100000000001,28.446097000000002,null,"2017-01-18",9341.9699999999993,0.16286400000000001,1.29454,19.597422999999999,null,"2017-01-18",-0.38604699999999997,0.16286400000000001,null,0.36116100000000001,1.29454,null,28.446097000000002,19.597422999999999]
["2017-01-17",72.540000000000006,1.3787000000000001E-2,1.3270010000000001,28.758141999999999,null,"2017-01-17",9354.5300000000007,0.29753000000000002,1.9431750000000001,20.516850999999999,null,"2017-01-17",1.3787000000000001E-2,0.29753000000000002,null,1.3270010000000001,1.9431750000000001,null,28.758141999999999,20.516850999999999]
["2017-01-16",72.05,-0.66179500000000002,0.57230599999999998,27.888394999999999,null,"2017-01-16",9292.33,-0.36936600000000003,1.387427,19.715512,null,"2017-01-16",-0.66179500000000002,-0.36936600000000003,null,0.57230599999999998,1.387427,null,27.888394999999999,19.715512]
["2017-01-13",72.78,-0.46498899999999999,1.195773,28.732685,null,"2017-01-13",9378.83,-3.5279999999999999E-2,1.7318260000000001,19.863226000000001,null,"2017-01-13",-0.46498899999999999,-3.5279999999999999E-2,null,1.195773,1.7318260000000001,null,28.732685,19.863226000000001]
["2017-01-12",73.14,0.32921800000000001,1.2598640000000001,30.280021999999999,null,"2017-01-12",9410.18,0.64428200000000002,1.7030890000000001,21.133302,null,"2017-01-12",0.32921800000000001,0.64428200000000002,null,1.2598640000000001,1.7030890000000001,null,30.280021999999999,21.133302]
["2017-01-11",72.47,-0.97021000000000002,0.93314799999999998,29.291345,null,"2017-01-11",9345.74,-0.499751,1.365753,19.995325999999999,null,"2017-01-11",-0.97021000000000002,-0.499751,null,0.93314799999999998,1.365753,null,29.291345,19.995325999999999]
["2017-01-10",72.61,-0.77890099999999995,1.00153,27.873396,null,"2017-01-10",9349.64,-0.458229,0.90472399999999997,18.440277999999999,null,"2017-01-10",-0.77890099999999995,-0.458229,null,1.00153,0.90472399999999997,null,27.873396,18.440277999999999]
["2017-01-09",72.56,-0.84722600000000003,0.931979,27.785340999999999,null,"2017-01-09",9342.42,-0.53509799999999996,0.82680299999999995,18.348815999999999,null,"2017-01-09",-0.84722600000000003,-0.53509799999999996,null,0.931979,0.82680299999999995,null,27.785340999999999,18.348815999999999]
["2017-01-06",72.75,1.196272,1.0416669999999999,26.296257000000001,null,"2017-01-06",9372.2199999999993,1.312864,0.94686599999999999,17.293648999999998,null,"2017-01-06",1.196272,1.312864,null,1.0416669999999999,0.94686599999999999,null,26.296257000000001,17.293648999999998]
["2017-01-05",72.58,2.0959349999999999,0.93171999999999999,24.506456,null,"2017-01-05",9358.14,2.1557400000000002,0.92598599999999998,15.8887,null,"2017-01-05",2.0959349999999999,2.1557400000000002,null,0.93171999999999999,0.92598599999999998,null,24.506456,15.8887]
["2017-01-04",72.069999999999993,1.165076,2.7758999999999999E-2,22.944046,null,"2017-01-04",9286.9599999999991,1.0606679999999999,-8.7209999999999996E-3,14.452335,null,"2017-01-04",1.165076,1.0606679999999999,null,2.7758999999999999E-2,-8.7209999999999996E-3,null,22.944046,14.452335]
["2017-01-03",72.03,1.1089279999999999,0.61461100000000002,19.102426999999999,null,"2017-01-03",9272.8799999999992,0.90744999999999998,0.41887799999999997,11.211480999999999,null,"2017-01-03",1.1089279999999999,0.90744999999999998,null,0.61461100000000002,0.41887799999999997,null,19.102426999999999,11.211480999999999]
["2016-12-30",71.77,-6.9617999999999999E-2,1.2270799999999999,18.672514,null,"2016-12-30",9253.5,0.138409,0.94525400000000004,10.979053,null,"2016-12-30",-6.9617999999999999E-2,0.138409,null,1.2270799999999999,0.94525400000000004,null,18.672514,10.979053]
["2016-12-29",71.03,-0.72676499999999999,-1.223752,18.240793,null,"2016-12-29",9153.09,-0.42741899999999999,-1.27075,10.359166999999999,null,"2016-12-29",-0.72676499999999999,-0.42741899999999999,null,-1.223752,-1.27075,null,18.240793,10.359166999999999]
["2016-12-28",71.569999999999993,-0.45897100000000002,0.67520000000000002,17.918061999999999,null,"2016-12-28",9201.4,-0.22597500000000001,7.4827000000000005E-2,10.084477,null,"2016-12-28",-0.45897100000000002,-0.22597500000000001,null,0.67520000000000002,7.4827000000000005E-2,null,17.918061999999999,10.084477]
["2016-12-27",70.790000000000006,-0.71528800000000003,-0.42199999999999999,16.689919,null,"2016-12-27",9109.27,-0.54372299999999996,-0.92718299999999998,8.9198260000000005,null,"2016-12-27",-0.71528800000000003,-0.54372299999999996,null,-0.42199999999999999,-0.92718299999999998,null,16.689919,8.9198260000000005]
["2016-12-26",70.78,-0.72931299999999999,-0.43606699999999998,16.673435000000001,null,"2016-12-26",9110.5400000000009,-0.52985700000000002,-0.91337000000000002,8.9350109999999994,null,"2016-12-26",-0.72931299999999999,-0.52985700000000002,null,-0.43606699999999998,-0.91337000000000002,null,16.673435000000001,8.9350109999999994]
["2016-12-23",70.430000000000007,-1.826038,-2.2620040000000001,16.895980000000002,null,"2016-12-23",9078.64,-1.0850679999999999,-2.2185079999999999,9.1746940000000006,null,"2016-12-23",-1.826038,-1.0850679999999999,null,-2.2620040000000001,-2.2185079999999999,null,16.895980000000002,9.1746940000000006]
["2016-12-22",70.739999999999995,-0.82714100000000002,-1.1597040000000001,17.738679999999999,null,"2016-12-22",9118.75,-0.16029099999999999,-1.2615780000000001,9.9606399999999997,null,"2016-12-22",-0.82714100000000002,-0.16029099999999999,null,-1.1597040000000001,-1.2615780000000001,null,17.738679999999999,9.9606399999999997]
["2016-12-21",71.44,1.2758719999999999,-1.3996E-2,19.335414,null,"2016-12-21",9204.26,1.804535,-0.26266499999999998,11.133435,null,"2016-12-21",1.2758719999999999,1.804535,null,-1.3996E-2,-0.26266499999999998,null,19.335414,11.133435]
["2016-12-20",71.87,2.160625,1.182599,20.232261000000001,null,"2016-12-20",9242.41,2.593245,0.88227100000000003,11.9299,null,"2016-12-20",2.160625,2.593245,null,1.182599,0.88227100000000003,null,20.232261000000001,11.9299]
["2016-12-19",71.81,2.0753379999999999,1.169343,20.131886000000002,null,"2016-12-19",9239.32,2.558945,0.94440199999999996,11.892478000000001,null,"2016-12-19",2.0753379999999999,2.558945,null,1.169343,0.94440199999999996,null,20.131886000000002,11.892478000000001]
["2016-12-16",72.53,3.6438980000000001,5.8986710000000002,21.880222,null,"2016-12-16",9326.7800000000007,4.067742,4.7682060000000002,13.954397999999999,null,"2016-12-16",3.6438980000000001,4.067742,null,5.8986710000000002,4.7682060000000002,null,21.880222,13.954397999999999]
["2016-12-15",72.930000000000007,4.5591400000000002,6.4826980000000001,24.474048,null,"2016-12-15",9360.35,4.8070599999999999,5.1452999999999998,15.941338,null,"2016-12-15",4.5591400000000002,4.8070599999999999,null,6.4826980000000001,5.1452999999999998,null,24.474048,15.941338]
["2016-12-14",73,4.4498499999999996,6.5849029999999997,24.635549000000001,null,"2016-12-14",9368.52,4.7885999999999997,5.2370739999999998,16.521561999999999,null,"2016-12-14",4.4498499999999996,4.7885999999999997,null,6.5849029999999997,5.2370739999999998,null,24.635549000000001,16.521561999999999]
["2016-12-13",73.12,4.4422230000000003,6.0786300000000004,23.342593999999998,null,"2016-12-13",9382.14,4.7375679999999996,4.9358950000000004,15.602109,null,"2016-12-13",4.4422230000000003,4.7375679999999996,null,6.0786300000000004,4.9358950000000004,null,23.342593999999998,15.602109]
["2016-12-12",72.900000000000006,4.1279820000000003,5.851604,22.971487,null,"2016-12-12",9349.94,4.3781030000000003,4.5029320000000004,15.205356,null,"2016-12-12",4.1279820000000003,4.3781030000000003,null,5.851604,4.5029320000000004,null,22.971487,15.205356]
["2016-12-09",73.180000000000007,4.3193159999999997,3.6543909999999999,22.02047,null,"2016-12-09",9392.68,5.0259410000000004,2.4855749999999999,14.132609,null,"2016-12-09",4.3193159999999997,5.0259410000000004,null,3.6543909999999999,2.4855749999999999,null,22.02047,14.132609]
["2016-12-08",73.06,0.99529999999999996,1.9679,20.314225,null,"2016-12-08",9375.86,1.718809,1.219598,12.368376,null,"2016-12-08",0.99529999999999996,1.718809,null,1.9679,1.219598,null,20.314225,12.368376]
["2016-12-07",71.959999999999994,-0.22185199999999999,0.19493199999999999,16.905225999999999,null,"2016-12-07",9263.89,0.80578099999999997,5.2056999999999999E-2,9.5764630000000004,null,"2016-12-07",-0.22185199999999999,0.80578099999999997,null,0.19493199999999999,5.2056999999999999E-2,null,16.905225999999999,9.5764630000000004]
["2016-12-06",71.89,1.1680269999999999,1.225007,17.850667000000001,null,"2016-12-06",9250.77,2.013862,0.75061100000000003,10.146572000000001,null,"2016-12-06",1.1680269999999999,2.013862,null,1.225007,0.75061100000000003,null,17.850667000000001,10.146572000000001]
["2016-12-05",71.09,4.2217999999999999E-2,1.181327,16.539211000000002,null,"2016-12-05",9160.66,1.0201640000000001,0.77589600000000003,9.0736550000000005,null,"2016-12-05",4.2217999999999999E-2,1.0201640000000001,null,1.181327,0.77589600000000003,null,16.539211000000002,9.0736550000000005]
["2016-12-02",71.239999999999995,-0.48889500000000002,2.7253059999999998,15.494562999999999,null,"2016-12-02",9189.49,0.55202700000000005,2.2468859999999999,8.6562059999999992,null,"2016-12-02",-0.48889500000000002,0.55202700000000005,null,2.7253059999999998,2.2468859999999999,null,15.494562999999999,8.6562059999999992]
["2016-12-01",71.989999999999995,-0.78555699999999995,4.2426880000000002,16.523848000000001,null,"2016-12-01",9263.5300000000007,-9.8891999999999994E-2,2.9149609999999999,9.4552949999999996,null,"2016-12-01",-0.78555699999999995,-9.8891999999999994E-2,null,4.2426880000000002,2.9149609999999999,null,16.523848000000001,9.4552949999999996]
["2016-11-30",71.819999999999993,-1.1288549999999999,3.0859770000000002,18.600207000000001,null,"2016-11-30",9240.7099999999991,-0.53185499999999997,1.8950579999999999,11.058083,null,"2016-11-30",{"$f":"IF(ISERROR(VLOOKUP($M195,XX_TEJ6,3,FALSE)=TRUE),\"\",VLOOKUP($M195,XX_TEJ6,3,FALSE))","v":-1.1288549999999999},{"$f":"IF(ISERROR(VLOOKUP($M195,XX_TEJ7,3,FALSE)=TRUE),\"\",VLOOKUP($M195,XX_TEJ7,3,FALSE))","v":-0.53185499999999997},null,{"$f":"IF(ISERROR(VLOOKUP($M195,XX_TEJ6,4,FALSE)=TRUE),\"\",VLOOKUP($M195,XX_TEJ6,4,FALSE))","v":3.0859770000000002},{"$f":"IF(ISERROR(VLOOKUP($M195,XX_TEJ7,4,FALSE)=TRUE),\"\",VLOOKUP($M195,XX_TEJ7,4,FALSE))","v":1.8950579999999999},null,{"$f":"IF(ISERROR(VLOOKUP($M195,XX_TEJ6,5,FALSE)=TRUE),\"\",VLOOKUP($M195,XX_TEJ6,5,FALSE))","v":18.600207000000001},{"$f":"IF(ISERROR(VLOOKUP($M195,XX_TEJ7,5,FALSE)=TRUE),\"\",VLOOKUP($M195,XX_TEJ7,5,FALSE))","v":11.058083}]
["2016-11-29",71.55,-1.7440260000000001,1.9957229999999999,17.084726,null,"2016-11-29",9192.3799999999992,-1.2306969999999999,0.90239800000000003,9.4539439999999999,null,{"$f":"IF($A196=\"\",\"\",$A196)","v":"2016-11-29"},-1.7440260000000001,-1.2306969999999999,null,1.9957229999999999,0.90239800000000003,null,17.084726,9.4539439999999999]
["2016-11-28",71.900000000000006,-1.2633890000000001,2.2614139999999998,17.657468000000001,null,"2016-11-28",9222.24,-0.90986100000000003,0.99126999999999998,9.809488,null,"2016-11-28",-1.2633890000000001,-0.90986100000000003,null,2.2614139999999998,0.99126999999999998,null,17.657468000000001,9.809488]
["2016-11-25",71.3,-3.0459610000000001,1.5235650000000001,16.430942999999999,null,"2016-11-25",9159.07,-2.4141110000000001,0.47830800000000001,9.2168860000000006,null,"2016-11-25",-3.0459610000000001,-2.4141110000000001,null,1.5235650000000001,0.47830800000000001,null,16.430942999999999,9.2168860000000006]
["2016-11-24",71.34,-2.193584,2.9734409999999998,16.552668000000001,null,"2016-11-24",9152.11,-1.8277289999999999,1.4941150000000001,8.9518749999999994,null,"2016-11-24",-2.193584,-1.8277289999999999,null,2.9734409999999998,1.4941150000000001,null,16.552668000000001,8.9518749999999994]
["2016-11-23",71.739999999999995,-1.2933410000000001,3.3717579999999998,15.878323,null,"2016-11-23",9178.23,-1.3790260000000001,1.6310610000000001,8.1607590000000005,null,"2016-11-23",-1.2933410000000001,-1.3790260000000001,null,3.3717579999999998,1.6310610000000001,null,15.878323,8.1607590000000005]
["2016-11-22",71.33,-1.8574569999999999,3.3768120000000001,15.547943999999999,null,"2016-11-22",9133.39,-1.8608359999999999,1.6876329999999999,7.8901890000000003,null,"2016-11-22",-1.8574569999999999,-1.8608359999999999,null,3.3768120000000001,1.6876329999999999,null,15.547943999999999,7.8901890000000003]
["2016-11-21",70.540000000000006,-2.9444140000000001,1.6866080000000001,14.268217999999999,null,"2016-11-21",9041.11,-2.8523939999999999,7.5712000000000002E-2,6.8001110000000002,null,"2016-11-21",-2.9444140000000001,-2.8523939999999999,null,1.6866080000000001,7.5712000000000002E-2,null,14.268217999999999,6.8001110000000002]
["2016-11-18",70.349999999999994,-2.2780939999999998,0.39960000000000001,15.908001000000001,null,"2016-11-18",9008.7900000000009,-2.3181150000000001,-1.246478,8.0129780000000004,null,"2016-11-18",-2.2780939999999998,-2.3181150000000001,null,0.39960000000000001,-1.246478,null,15.908001000000001,8.0129780000000004]
["2016-11-17",70.38,-1.69018,0.51413900000000001,14.614293,null,"2016-11-17",8995.26,-1.972054,-1.342883,6.8394259999999996,null,"2016-11-17",-1.69018,-1.972054,null,0.51413900000000001,-1.342883,null,14.614293,6.8394259999999996]
["2016-11-16",69.98,-2.3171409999999999,-1.4288E-2,15.826247,null,"2016-11-16",8962.2199999999993,-2.2143619999999999,-1.626061,8.0384309999999992,null,"2016-11-16",-2.3171409999999999,-2.2143619999999999,null,-1.4288E-2,-1.626061,null,15.826247,8.0384309999999992]
["2016-11-15",69.75,-2.638191,-1.0076639999999999,14.900746,null,"2016-11-15",8931.0300000000007,-2.5546720000000001,-2.3772180000000001,7.2216820000000004,null,"2016-11-15",-2.638191,-2.5546720000000001,null,-1.0076639999999999,-2.3772180000000001,null,14.900746,7.2216820000000004]
["2016-11-14",69.89,-2.4427690000000002,-0.58321500000000004,15.131371,null,"2016-11-14",8940.4,-2.4524370000000002,-2.2948750000000002,7.334174,null,"2016-11-14",-2.4427690000000002,-2.4524370000000002,null,-0.58321500000000004,-2.2948750000000002,null,15.131371,7.334174]
["2016-11-11",70.010000000000005,-2.493036,-0.31325599999999998,14.03009,null,"2016-11-11",8957.76,-2.842355,-1.9061900000000001,6.4497840000000002,null,"2016-11-11",-2.493036,-2.842355,null,-0.31325599999999998,-1.9061900000000001,null,14.03009,6.4497840000000002]
["2016-11-10",71.69,-0.27820299999999998,1.2570619999999999,15.282495000000001,null,"2016-11-10",9152.18,-1.2263360000000001,-0.52432400000000001,7.2073,null,"2016-11-10",-0.27820299999999998,-1.2263360000000001,null,1.2570619999999999,-0.52432400000000001,null,15.282495000000001,7.2073]
["2016-11-09",70.150000000000006,-2.4203640000000002,-0.42583399999999999,11.094212000000001,null,"2016-11-09",8943.2000000000007,-3.481725,-2.3143440000000002,3.4795569999999998,null,"2016-11-09",-2.4203640000000002,-3.481725,null,-0.42583399999999999,-2.3143440000000002,null,11.094212000000001,3.4795569999999998]
["2016-11-08",72.34,0.62595599999999996,2.9164889999999999,14.419238,null,"2016-11-08",9217.43,-0.52213500000000002,0.73407800000000001,6.0258330000000004,null,"2016-11-08",0.62595599999999996,-0.52213500000000002,null,2.9164889999999999,0.73407800000000001,null,14.419238,6.0258330000000004]
["2016-11-07",72.12,0.31993300000000002,3.4720230000000001,14.071267000000001,null,"2016-11-07",9189.84,-0.81989599999999996,1.0747770000000001,5.7084720000000004,null,"2016-11-07",0.31993300000000002,-0.81989599999999996,null,3.4720230000000001,1.0747770000000001,null,14.071267000000001,5.7084720000000004]
["2016-11-04",71.06,-1.3740460000000001,2.9556650000000002,9.6700630000000007,null,"2016-11-04",9068.15,-2.3646150000000001,0.48134500000000002,2.383759,null,"2016-11-04",-1.3740460000000001,-2.3646150000000001,null,2.9556650000000002,0.48134500000000002,null,9.6700630000000007,2.383759]
["2016-11-03",71.05,-0.75429500000000005,3.3454549999999998,11.92417,null,"2016-11-03",9067.27,-1.807736,0.72830600000000001,4.0637239999999997,null,"2016-11-03",-0.75429500000000005,-1.807736,null,3.3454549999999998,0.72830600000000001,null,11.92417,4.0637239999999997]
["2016-11-02",71.59,0.97320200000000001,3.0961979999999998,14.214504,null,"2016-11-02",9139.0400000000009,-0.30337599999999998,0.77496799999999999,6.0857109999999999,null,"2016-11-02",0.97320200000000001,-0.30337599999999998,null,3.0961979999999998,0.77496799999999999,null,14.214504,6.0857109999999999]
["2016-11-01",72.56,2.341326,4.3728420000000003,16.681515999999998,null,"2016-11-01",9272.7000000000007,1.154704,2.1142620000000001,8.3979890000000008,null,"2016-11-01",2.341326,1.154704,null,4.3728420000000003,2.1142620000000001,null,16.681515999999998,8.3979890000000008]
["2016-10-31",72.64,2.454161,6.0592790000000001,16.810161000000001,null,"2016-10-31",9290.1200000000008,1.3447370000000001,3.4026719999999999,8.6016290000000009,null,"2016-10-31",2.454161,1.3447370000000001,null,6.0592790000000001,3.4026719999999999,null,16.810161000000001,8.6016290000000009]
["2016-10-28",72.819999999999993,2.433535,4.8675119999999996,15.412881,null,"2016-10-28",9306.92,1.222467,2.5370620000000002,7.3959239999999999,null,"2016-10-28",2.433535,1.222467,null,4.8675119999999996,2.5370620000000002,null,15.412881,7.3959239999999999]
["2016-10-27",72.64,2.1803349999999999,4.9407690000000004,14.50015,null,"2016-10-27",9299.5499999999993,1.1423110000000001,2.605648,6.8751639999999998,null,"2016-10-27",2.1803349999999999,1.1423110000000001,null,4.9407690000000004,2.605648,null,14.50015,6.8751639999999998]
["2016-10-26",73.319999999999993,3.1368689999999999,6.5159969999999996,14.767816,null,"2016-10-26",9362.25,1.8242389999999999,3.7392560000000001,7.0539120000000004,null,"2016-10-26",3.1368689999999999,1.8242389999999999,null,6.5159969999999996,3.7392560000000001,null,14.767816,7.0539120000000004]
["2016-10-25",73.540000000000006,2.0538439999999998,7.4369290000000001,15.954904000000001,null,"2016-10-25",9385.65,1.088144,4.3816110000000004,8.2067739999999993,null,"2016-10-25",2.0538439999999998,1.088144,null,7.4369290000000001,4.3816110000000004,null,15.954904000000001,8.2067739999999993]
["2016-10-24",72.94,1.2212050000000001,6.5296209999999997,15.008848,null,"2016-10-24",9322.5,0.40798699999999999,3.4323220000000001,7.47872,null,"2016-10-24",1.2212050000000001,0.40798699999999999,null,6.5296209999999997,3.4323220000000001,null,15.008848,7.47872]
["2016-10-21",72.680000000000007,1.721484,5.4953940000000001,15.647050999999999,null,"2016-10-21",9306.57,0.845966,2.7605400000000002,8.0999110000000005,null,"2016-10-21",1.721484,0.845966,null,5.4953940000000001,2.7605400000000002,null,15.647050999999999,8.0999110000000005]
["2016-10-20",72.86,2.5763760000000002,6.6281600000000003,15.230836999999999,null,"2016-10-20",9317.24,1.699052,3.436623,7.6689470000000002,null,"2016-10-20",2.5763760000000002,1.699052,null,6.6281600000000003,3.436623,null,15.230836999999999,7.6689470000000002]
["2016-10-19",72.61,2.2964220000000002,5.8034090000000003,14.939943,null,"2016-10-19",9283.99,1.432445,2.757317,7.5594049999999999,null,"2016-10-19",2.2964220000000002,1.432445,null,5.8034090000000003,2.757317,null,14.939943,7.5594049999999999]
["2016-10-18",71.989999999999995,5.1102350000000003,5.370177,14.200962000000001,null,"2016-10-18",9222.58,3.5977220000000001,2.379718,7.177613,null,"2016-10-18",5.1102350000000003,3.5977220000000001,null,5.370177,2.379718,null,14.200962000000001,7.177613]
["2016-10-17",71.59,4.5262079999999996,5.6093019999999996,13.566425000000001,null,"2016-10-17",9176.2199999999993,3.0769579999999999,2.5293160000000001,6.6388530000000001,null,"2016-10-17",4.5262079999999996,3.0769579999999999,null,5.6093019999999996,2.5293160000000001,null,13.566425000000001,6.6388530000000001]
["2016-10-14",71.64,4.5992119999999996,6.9139270000000002,14.850097,null,"2016-10-14",9165.17,2.9528319999999999,3.3701539999999999,7.5407359999999999,null,"2016-10-14",4.5992119999999996,2.9528319999999999,null,6.9139270000000002,3.3701539999999999,null,14.850097,7.5407359999999999]
["2016-10-13",71.92,4.3377340000000002,7.4902629999999997,14.420311,null,"2016-10-13",9219.17,3.1131340000000001,4.0802690000000004,7.6010280000000003,null,"2016-10-13",4.3377340000000002,3.1131340000000001,null,7.4902629999999997,4.0802690000000004,null,14.420311,7.6010280000000003]
["2016-10-12",72.23,4.8787570000000002,8.0812439999999999,14.546868999999999,null,"2016-10-12",9252.6,3.4149769999999999,4.650137,7.9181499999999998,null,"2016-10-12",4.8787570000000002,3.4149769999999999,null,8.0812439999999999,4.650137,null,14.546868999999999,7.9181499999999998]
["2016-10-11",71.8,2.8800690000000002,8.3830620000000007,15.746577,null,"2016-10-11",9219.82,1.8349420000000001,4.9320149999999998,9.1624870000000005,null,"2016-10-11",2.8800690000000002,1.8349420000000001,null,8.3830620000000007,4.9320149999999998,null,15.746577,9.1624870000000005]
["2016-10-07",71.89,9.7465999999999997E-2,10.900315000000001,15.695114999999999,null,"2016-10-07",9265.81,7.2792999999999997E-2,7.2318769999999999,9.0707369999999994,null,"2016-10-07",9.7465999999999997E-2,7.2792999999999997E-2,null,10.900315000000001,7.2318769999999999,null,15.695114999999999,9.0707369999999994]
["2016-10-06",72,1.379893,12.250327,17.429174,null,"2016-10-06",9284.31,1.1158969999999999,8.2623680000000004,10.605187000000001,null,"2016-10-06",1.379893,1.1158969999999999,null,12.250327,8.2623680000000004,null,17.429174,10.605187000000001]
["2016-10-05",71.91,2.34842,10.142279,18.168652999999999,null,"2016-10-05",9272.2800000000007,2.003822,6.3814310000000001,11.013892999999999,null,"2016-10-05",2.34842,2.003822,null,10.142279,6.3814310000000001,null,18.168652999999999,11.013892999999999]
["2016-10-04",72.05,3.8932950000000002,9.5445349999999998,18.622810999999999,null,"2016-10-04",9287.77,3.3403990000000001,6.0177519999999998,11.833069999999999,null,"2016-10-04",3.8932950000000002,3.3403990000000001,null,9.5445349999999998,6.0177519999999998,null,18.622810999999999,11.833069999999999]
["2016-10-03",71.59,3.2299929999999999,9.2883469999999999,17.865469000000001,null,"2016-10-03",9234.2000000000007,2.7443520000000001,5.6757419999999996,11.188039,null,"2016-10-03",3.2299929999999999,2.7443520000000001,null,9.2883469999999999,5.6757419999999996,null,17.865469000000001,11.188039]
["2016-09-30",70.900000000000006,1.765466,9.4064479999999993,18.334626,null,"2016-09-30",9166.85,1.080622,5.7724039999999999,12.047196,null,"2016-09-30",1.765466,1.080622,null,9.4064479999999993,5.7724039999999999,null,18.334626,12.047196]
["2016-09-29",71.91,2.5089090000000001,12.369607999999999,20.987634,null,"2016-09-29",9270.9,1.764292,7.9698969999999996,14.000258000000001,null,"2016-09-29",2.5089090000000001,1.764292,null,12.369607999999999,7.9698969999999996,null,20.987634,14.000258000000001]
["2016-09-26",71.09,1.1093729999999999,13.703528,19.607994999999999,null,"2016-09-26",9194.52,0.68771300000000002,8.4644429999999993,13.061045999999999,null,"2016-09-26",1.1093729999999999,0.68771300000000002,null,13.703528,8.4644429999999993,null,19.607994999999999,13.061045999999999]
["2016-09-23",72.06,3.8328530000000001,12.517158999999999,20.540545000000002,null,"2016-09-23",9284.6200000000008,2.8091240000000002,7.0065970000000002,13.318004,null,"2016-09-23",3.8328530000000001,2.8091240000000002,null,12.517158999999999,7.0065970000000002,null,20.540545000000002,13.318004]
["2016-09-22",71.569999999999993,3.7246380000000001,11.237306,16.965447000000001,null,"2016-09-22",9235.26,2.8218139999999998,5.95451,10.391444999999999,null,"2016-09-22",3.7246380000000001,2.8218139999999998,null,11.237306,5.95451,null,16.965447000000001,10.391444999999999]
["2016-09-21",71.45,2.9984139999999999,11.444350999999999,17.394259999999999,null,"2016-09-21",9228.5,2.1499250000000001,6.2597509999999996,11.092518999999999,null,"2016-09-21",2.9984139999999999,2.1499250000000001,null,11.444350999999999,6.2597509999999996,null,17.394259999999999,11.092518999999999]
["2016-09-20",71.03,2.3929649999999998,11.597433000000001,14.240633000000001,null,"2016-09-20",9161.58,1.4091899999999999,6.2098880000000003,8.2655209999999997,null,"2016-09-20",2.3929649999999998,1.4091899999999999,null,11.597433000000001,6.2098880000000003,null,14.240633000000001,8.2655209999999997]
["2016-09-19",70.98,2.3208880000000001,12.233071000000001,14.160216,null,"2016-09-19",9152.8799999999992,1.3128899999999999,6.8253329999999997,8.1627109999999998,null,"2016-09-19",2.3208880000000001,1.3128899999999999,null,12.233071000000001,6.8253329999999997,null,14.160216,8.1627109999999998]
["2016-09-14",68.489999999999995,-2.5746799999999999,8.1438710000000007,11.896825,null,"2016-09-14",8902.2999999999993,-2.7112509999999999,3.8033519999999998,7.1625040000000002,null,"2016-09-14",-2.5746799999999999,-2.7112509999999999,null,8.1438710000000007,3.8033519999999998,null,11.896825,7.1625040000000002]
["2016-09-13",68.930000000000007,-1.9487909999999999,9.4189100000000003,12.739204000000001,null,"2016-09-13",8940.83,-2.2901760000000002,4.7399199999999997,7.6453620000000004,null,"2016-09-13",-1.9487909999999999,-2.2901760000000002,null,9.4189100000000003,4.7399199999999997,null,12.739204000000001,7.6453620000000004]
["2016-09-12",68.87,-2.0341390000000001,6.7948870000000001,12.641069999999999,null,"2016-09-12",8947.06,-2.2220909999999998,2.657111,7.72037,null,"2016-09-12",-2.0341390000000001,-2.2220909999999998,null,6.7948870000000001,2.657111,null,12.641069999999999,7.72037]
["2016-09-10",69.790000000000006,-1.4265540000000001,8.2215059999999998,14.901956999999999,null,"2016-09-10",9053.69,-1.5948180000000001,3.8805670000000001,9.4937769999999997,null,"2016-09-10",-1.4265540000000001,-1.5948180000000001,null,8.2215059999999998,3.8805670000000001,null,14.901956999999999,9.4937769999999997]
["2016-09-09",70.599999999999994,0.212917,9.4775519999999993,15.109857,null,"2016-09-09",9164.8799999999992,0.107044,5.1563429999999997,10.594526999999999,null,"2016-09-09",0.212917,0.107044,null,9.4775519999999993,5.1563429999999997,null,15.109857,10.594526999999999]
["2016-09-08",71.650000000000006,1.934841,11.105759000000001,21.747250999999999,null,"2016-09-08",9262.89,1.2308939999999999,6.2808929999999998,15.764419,null,"2016-09-08",1.934841,1.2308939999999999,null,11.105759000000001,6.2808929999999998,null,21.747250999999999,15.764419]
["2016-09-07",71.819999999999993,3.0416069999999999,12.090545000000001,22.135524,null,"2016-09-07",9259.07,1.8362050000000001,6.672542,15.933142999999999,null,"2016-09-07",3.0416069999999999,1.8362050000000001,null,12.090545000000001,6.672542,null,22.135524,15.933142999999999]
["2016-09-06",71.02,1.893831,12.06875,20.187633999999999,null,"2016-09-06",9181.85,0.98689899999999997,6.8015879999999997,14.764518000000001,null,"2016-09-06",1.893831,0.98689899999999997,null,12.06875,6.8015879999999997,null,20.187633999999999,14.764518000000001]
[null,null,null,null,null,null,null,null,null,null,null,null,"","","",null,"","",null,"",""]
[null,null,null,null,null,null,null,null,null,null,null,null,"","","",null,"","",null,"",""]
[null,null,null,null,null,null,null,null,null,null,null,null,"","","",null,"","",null,"",""]
[null,null,null,null,null,null,null,null,null,null,null,null,"","","",null,"","",null,"",""]
[null,null,null,null,null,null,null,null,null,null,null,null,"","","",null,"","",null,"",""]
[null,null,null,null,null,null,null,null,null,null,null,null,"","","",null,"","",null,"",""]
[null,null,null,null,null,null,null,null,null,null,null,null,"",{"$f":"IF(ISERROR(VLOOKUP($M259,XX_TEJ6,3,FALSE)=TRUE),\"\",VLOOKUP($M259,XX_TEJ6,3,FALSE))","v":""},{"$f":"IF(ISERROR(VLOOKUP($M259,XX_TEJ7,3,FALSE)=TRUE),\"\",VLOOKUP($M259,XX_TEJ7,3,FALSE))","v":""},null,{"$f":"IF(ISERROR(VLOOKUP($M259,XX_TEJ6,4,FALSE)=TRUE),\"\",VLOOKUP($M259,XX_TEJ6,4,FALSE))","v":""},{"$f":"IF(ISERROR(VLOOKUP($M259,XX_TEJ7,4,FALSE)=TRUE),\"\",VLOOKUP($M259,XX_TEJ7,4,FALSE))","v":""},null,{"$f":"IF(ISERROR(VLOOKUP($M259,XX_TEJ6,5,FALSE)=TRUE),\"\",VLOOKUP($M259,XX_TEJ6,5,FALSE))","v":""},{"$f":"IF(ISERROR(VLOOKUP($M259,XX_TEJ7,5,FALSE)=TRUE),\"\",VLOOKUP($M259,XX_TEJ7,5,FALSE))","v":""}]
[null,null,null,null,null,null,null,null,null,null,null,null,{"$f":"IF($A260=\"\",\"\",$A260)","v":""},"","",null,"","",null,"",""]
[null,null,null,null,null,null,null,null,null,null,null,null,"","","",null,"","",null,"",""]
[null,null,null,null,null,null,null,null,null,null,null,null,"","","",null,"","",null,"",""]
[null,null,null,null,null,null,null,null,null,null,null,null,"","","",null,"","",null,"",""]
[null,null,null,null,null,null,null,null,null,null,null,null,"","","",null,"","",null,"",""]
[null,null,null,null,null,null,null,null,null,null,null,null,"","","",null,"","",null,"",""]
[null,null,null,null,null,null,null,null,null,null,null,null,"","","",null,"","",null,"",""]
[null,null,null,null,null,null,null,null,null,null,null,null,"","","",null,"","",null,"",""]
[null,null,null,null,null,null,null,null,null,null,null,null,"","","",null,"","",null,"",""]
[null,null,null,null,null,null,null,null,null,null,null,null,"","","",null,"","",null,"",""]
[null,null,null,null,null,null,null,null,null,null,null,null,"","","",null,"","",null,"",""]
[null,null,null,null,null,null,null,null,null,null,null,null,"","","",null,"","",null,"",""]
[null,null,null,null,null,null,null,null,null,null,null,null,"","","",null,"","",null,"",""]
[null,null,null,null,null,null,null,null,null,null,null,null,"","","",null,"","",null,"",""]
[null,null,null,null,null,null,null,null,null,null,null,null,"","","",null,"","",null,"",""]
[null,null,null,null,null,null,null,null,null,null,null,null,"","","",null,"","",null,"",""]
[null,null,null,null,null,null,null,null,null,null,null,null,"","","",null,"","",null,"",""]
[null,null,null,null,null,null,null,null,null,null,null,null,"","","",null,"","",null,"",""]
[null,null,null,null,null,null,null,null,null,null,null,null,"","","",null,"","",null,"",""]
[null,null,null,null,null,null,null,null,null,null,null,null,"","","",null,"","",null,"",""]
[null,null,null,null,null,null,null,null,null,null,null,null,"","","",null,"","",null,"",""]
[null,null,null,null,null,null,null,null,null,null,null,null,"","","",null,"","",null,"",""]
[null,null,null,null,null,null,null,null,null,null,null,null,"","","",null,"","",null,"",""]
[null,null,null,null,null,null,null,null,null,null,null,null,"","","",null,"","",null,"",""]
[null,null,null,null,null,null,null,null,null,null,null,null,"","","",null,"","",null,"",""]
[null,null,null,null,null,null,null,null,null,null,null,null,"","","",null,"","",null,"",""]
[null,null,null,null,null,null,null,null,null,null,null,null,"","","",null,"","",null,"",""]
[null,null,null,null,null,null,null,null,null,null,null,null,"","","",null,"","",null,"",""]
[null,null,null,null,null,null,null,null,null,null,null,null,"","","",null,"","",null,"",""]
[null,null,null,null,null,null,null,null,null,null,null,null,"","","",null,"","",null,"",""]
[null,null,null,null,null,null,null,null,null,null,null,null,"","","",null,"","",null,"",""]
[null,null,null,null,null,null,null,null,null,null,null,null,"","","",null,"","",null,"",""]
[null,null,null,null,null,null,null,null,null,null,null,null,"","","",null,"","",null,"",""]
[null,null,null,null,null,null,null,null,null,null,null,null,"","","",null,"","",null,"",""]
[null,null,null,null,null,null,null,null,null,null,null,null,"","","",null,"","",null,"",""]
[null,null,null,null,null,null,null,null,null,null,null,null,"","","",null,"","",null,"",""]
[null,null,null,null,null,null,null,null,null,null,null,null,"","","",null,"","",null,"",""]
[null,null,null,null,null,null,null,null,null,null,null,null,"","","",null,"","",null,"",""]
[null,null,null,null,null,null,null,null,null,null,null,null,"","","",null,"","",null,"",""]
[null,null,null,null,null,null,null,null,null,null,null,null,"","","",null,"","",null,"",""]
[null,null,null,null,null,null,null,null,null,null,null,null,"","","",null,"","",null,"",""]
[null,null,null,null,null,null,null,null,null,null,null,null,"","","",null,"","",null,"",""]
[null,null,null,null,null,null,null,null,null,null,null,null,"","","",null,"","",null,"",""]
[null,null,null,null,null,null,null,null,null,null,null,null,"","","",null,"","",null,"",""]
[null,null,null,null,null,null,null,null,null,null,null,null,"","","",null,"","",null,"",""]
[null,null,null,null,null,null,null,null,null,null,null,null,"","","",null,"","",null,"",""]
[null,null,null,null,null,null,null,null,null,null,null,null,"","","",null,"","",null,"",""]
[null,null,null,null,null,null,null,null,null,null,null,null,"","","",null,"","",null,"",""]
[null,null,null,null,null,null,null,null,null,null,null,null,"","","",null,"","",null,"",""]
[null,null,null,null,null,null,null,null,null,null,null,null,"","","",null,"","",null,"",""]
[null,null,null,null,null,null,null,null,null,null,null,null,"","","",null,"","",null,"",""]
[null,null,null,null,null,null,null,null,null,null,null,null,"","","",null,"","",null,"",""]
[null,null,null,null,null,null,null,null,null,null,null,null,"","","",null,"","",null,"",""]
[null,null,null,null,null,null,null,null,null,null,null,null,"","","",null,"","",null,"",""]
[null,null,null,null,null,null,null,null,null,null,null,null,"","","",null,"","",null,"",""]
[null,null,null,null,null,null,null,null,null,null,null,null,"","","",null,"","",null,"",""]
[null,null,null,null,null,null,null,null,null,null,null,null,"","","",null,"","",null,"",""]
[null,null,null,null,null,null,null,null,null,null,null,null,"","","",null,"","",null,"",""]
[null,null,null,null,null,null,null,null,null,null,null,null,"","","",null,"","",null,"",""]
[null,null,null,null,null,null,null,null,null,null,null,null,"","","",null,"","",null,"",""]
[null,null,null,null,null,null,null,null,null,null,null,null,"","","",null,"","",null,"",""]
[null,null,null,null,null,null,null,null,null,null,null,null,"","","",null,"","",null,"",""]
[null,null,null,null,null,null,null,null,null,null,null,null,"","","",null,"","",null,"",""]
[null,null,null,null,null,null,null,null,null,null,null,null,"",{"$f":"IF(ISERROR(VLOOKUP($M323,XX_TEJ6,3,FALSE)=TRUE),\"\",VLOOKUP($M323,XX_TEJ6,3,FALSE))","v":""},{"$f":"IF(ISERROR(VLOOKUP($M323,XX_TEJ7,3,FALSE)=TRUE),\"\",VLOOKUP($M323,XX_TEJ7,3,FALSE))","v":""},null,{"$f":"IF(ISERROR(VLOOKUP($M323,XX_TEJ6,4,FALSE)=TRUE),\"\",VLOOKUP($M323,XX_TEJ6,4,FALSE))","v":""},{"$f":"IF(ISERROR(VLOOKUP($M323,XX_TEJ7,4,FALSE)=TRUE),\"\",VLOOKUP($M323,XX_TEJ7,4,FALSE))","v":""},null,{"$f":"IF(ISERROR(VLOOKUP($M323,XX_TEJ6,5,FALSE)=TRUE),\"\",VLOOKUP($M323,XX_TEJ6,5,FALSE))","v":""},{"$f":"IF(ISERROR(VLOOKUP($M323,XX_TEJ7,5,FALSE)=TRUE),\"\",VLOOKUP($M323,XX_TEJ7,5,FALSE))","v":""}]
[null,null,null,null,null,null,null,null,null,null,null,null,{"$f":"IF($A324=\"\",\"\",$A324)","v":""},"","",null,"","",null,"",""]
[null,null,null,null,null,null,null,null,null,null,null,null,"","","",null,"","",null,"",""]
[null,null,null,null,null,null,null,null,null,null,null,null,"","","",null,"","",null,"",""]
[null,null,null,null,null,null,null,null,null,null,null,null,"","","",null,"","",null,"",""]
[null,null,null,null,null,null,null,null,null,null,null,null,"","","",null,"","",null,"",""]
[null,null,null,null,null,null,null,null,null,null,null,null,"","","",null,"","",null,"",""]
[null,null,null,null,null,null,null,null,null,null,null,null,"","","",null,"","",null,"",""]
[null,null,null,null,null,null,null,null,null,null,null,null,"","","",null,"","",null,"",""]
[null,null,null,null,null,null,null,null,null,null,null,null,"","","",null,"","",null,"",""]
[null,null,null,null,null,null,null,null,null,null,null,null,"","","",null,"","",null,"",""]
[null,null,null,null,null,null,null,null,null,null,null,null,"","","",null,"","",null,"",""]
[null,null,null,null,null,null,null,null,null,null,null,null,"","","",null,"","",null,"",""]
[null,null,null,null,null,null,null,null,null,null,null,null,"","","",null,"","",null,"",""]
[null,null,null,null,null,null,null,null,null,null,null,null,"","","",null,"","",null,"",""]
[null,null,null,null,null,null,null,null,null,null,null,null,"","","",null,"","",null,"",""]
[null,null,null,null,null,null,null,null,null,null,null,null,"","","",null,"","",null,"",""]
[null,null,null,null,null,null,null,null,null,null,null,null,"","","",null,"","",null,"",""]
[null,null,null,null,null,null,null,null,null,null,null,null,"","","",null,"","",null,"",""]
[null,null,null,null,null,null,null,null,null,null,null,null,"","","",null,"","",null,"",""]
[null,null,null,null,null,null,null,null,null,null,null,null,"","","",null,"","",null,"",""]
[null,null,null,null,null,null,null,null,null,null,null,null,"","","",null,"","",null,"",""]
[null,null,null,null,null,null,null,null,null,null,null,null,"","","",null,"","",null,"",""]
[null,null,null,null,null,null,null,null,null,null,null,null,"","","",null,"","",null,"",""]
[null,null,null,null,null,null,null,null,null,null,null,null,"","","",null,"","",null,"",""]
[null,null,null,null,null,null,null,null,null,null,null,null,"","","",null,"","",null,"",""]
[null,null,null,null,null,null,null,null,null,null,null,null,"","","",null,"","",null,"",""]
[null,null,null,null,null,null,null,null,null,null,null,null,"","","",null,"","",null,"",""]
[null,null,null,null,null,null,null,null,null,null,null,null,"","","",null,"","",null,"",""]
[null,null,null,null,null,null,null,null,null,null,null,null,"","","",null,"","",null,"",""]
[null,null,null,null,null,null,null,null,null,null,null,null,"","","",null,"","",null,"",""]
[null,null,null,null,null,null,null,null,null,null,null,null,"","","",null,"","",null,"",""]
[null,null,null,null,null,null,null,null,null,null,null,null,"","","",null,"","",null,"",""]
[null,null,null,null,null,null,null,null,null,null,null,null,"","","",null,"","",null,"",""]
[null,null,null,null,null,null,null,null,null,null,null,null,"","","",null,"","",null,"",""]
[null,null,null,null,null,null,null,null,null,null,null,null,"","","",null,"","",null,"",""]
[null,null,null,null,null,null,null,null,null,null,null,null,"","","",null,"","",null,"",""]
[null,null,null,null,null,null,null,null,null,null,null,null,"","","",null,"","",null,"",""]
[null,null,null,null,null,null,null,null,null,null,null,null,"","","",null,"","",null,"",""]
[null,null,null,null,null,null,null,null,null,null,null,null,"","","",null,"","",null,"",""]
[null,null,null,null,null,null,null,null,null,null,null,null,"","","",null,"","",null,"",""]
[null,null,null,null,null,null,null,null,null,null,null,null,"","","",null,"","",null,"",""]
[null,null,null,null,null,null,null,null,null,null,null,null,"","","",null,"","",null,"",""]
[null,null,null,null,null,null,null,null,null,null,null,null,"","","",null,"","",null,"",""]
[null,null,null,null,null,null,null,null,null,null,null,null,"","","",null,"","",null,"",""]
[null,null,null,null,null,null,null,null,null,null,null,null,"","","",null,"","",null,"",""]
[null,null,null,null,null,null,null,null,null,null,null,null,"","","",null,"","",null,"",""]
[null,null,null,null,null,null,null,null,null,null,null,null,"","","",null,"","",null,"",""]
[null,null,null,null,null,null,null,null,null,null,null,null,"","","",null,"","",null,"",""]
[null,null,null,null,null,null,null,null,null,null,null,null,"","","",null,"","",null,"",""]
[null,null,null,null,null,null,null,null,null,null,null,null,"","","",null,"","",null,"",""]
[null,null,null,null,null,null,null,null,null,null,null,null,"","","",null,"","",null,"",""]
[null,null,null,null,null,null,null,null,null,null,null,null,"","","",null,"","",null,"",""]
[null,null,null,null,null,null,null,null,null,null,null,null,"","","",null,"","",null,"",""]
[null,null,null,null,null,null,null,null,null,null,null,null,"","","",null,"","",null,"",""]
[null,null,null,null,null,null,null,null,null,null,null,null,"","","",null,"","",null,"",""]
[null,null,null,null,null,null,null,null,null,null,null,null,"","","",null,"","",null,"",""]
[null,null,null,null,null,null,null,null,null,null,null,null,"","","",null,"","",null,"",""]
[null,null,null,null,null,null,null,null,null,null,null,null,"","","",null,"","",null,"",""]
[null,null,null,null,null,null,null,null,null,null,null,null,"","","",null,"","",null,"",""]
[null,null,null,null,null,null,null,null,null,null,null,null,"","","",null,"","",null,"",""]
[null,null,null,null,null,null,null,null,null,null,null,null,"","","",null,"","",null,"",""]
[null,null,null,null,null,null,null,null,null,null,null,null,"","","",null,"","",null,"",""]
[null,null,null,null,null,null,null,null,null,null,null,null,"","","",null,"","",null,"",""]
[null,null,null,null,null,null,null,null,null,null,null,null,"",{"$f":"IF(ISERROR(VLOOKUP($M387,XX_TEJ6,3,FALSE)=TRUE),\"\",VLOOKUP($M387,XX_TEJ6,3,FALSE))","v":""},{"$f":"IF(ISERROR(VLOOKUP($M387,XX_TEJ7,3,FALSE)=TRUE),\"\",VLOOKUP($M387,XX_TEJ7,3,FALSE))","v":""},null,{"$f":"IF(ISERROR(VLOOKUP($M387,XX_TEJ6,4,FALSE)=TRUE),\"\",VLOOKUP($M387,XX_TEJ6,4,FALSE))","v":""},{"$f":"IF(ISERROR(VLOOKUP($M387,XX_TEJ7,4,FALSE)=TRUE),\"\",VLOOKUP($M387,XX_TEJ7,4,FALSE))","v":""},null,{"$f":"IF(ISERROR(VLOOKUP($M387,XX_TEJ6,5,FALSE)=TRUE),\"\",VLOOKUP($M387,XX_TEJ6,5,FALSE))","v":""},{"$f":"IF(ISERROR(VLOOKUP($M387,XX_TEJ7,5,FALSE)=TRUE),\"\",VLOOKUP($M387,XX_TEJ7,5,FALSE))","v":""}]
[null,null,null,null,null,null,null,null,null,null,null,null,{"$f":"IF($A388=\"\",\"\",$A388)","v":""},"","",null,"","",null,"",""]
[null,null,null,null,null,null,null,null,null,null,null,null,"","","",null,"","",null,"",""]
[null,null,null,null,null,null,null,null,null,null,null,null,"","","",null,"","",null,"",""]
[null,null,null,null,null,null,null,null,null,null,null,null,"","","",null,"","",null,"",""]
[null,null,null,null,null,null,null,null,null,null,null,null,"","","",null,"","",null,"",""]
[null,null,null,null,null,null,null,null,null,null,null,null,"","","",null,"","",null,"",""]
[null,null,null,null,null,null,null,null,null,null,null,null,"","","",null,"","",null,"",""]
[null,null,null,null,null,null,null,null,null,null,null,null,"","","",null,"","",null,"",""]
[null,null,null,null,null,null,null,null,null,null,null,null,"","","",null,"","",null,"",""]
[null,null,null,null,null,null,null,null,null,null,null,null,"","","",null,"","",null,"",""]
[null,null,null,null,null,null,null,null,null,null,null,null,"","","",null,"","",null,"",""]
[null,null,null,null,null,null,null,null,null,null,null,null,"","","",null,"","",null,"",""]
[null,null,null,null,null,null,null,null,null,null,null,null,"","","",null,"","",null,"",""]
[null,null,null,null,null,null,null,null,null,null,null,null,"","","",null,"","",null,"",""]
[null,null,null,null,null,null,null,null,null,null,null,null,"","","",null,"","",null,"",""]
[null,null,null,null,null,null,null,null,null,null,null,null,"","","",null,"","",null,"",""]
[null,null,null,null,null,null,null,null,null,null,null,null,"","","",null,"","",null,"",""]
[null,null,null,null,null,null,null,null,null,null,null,null,"","","",null,"","",null,"",""]
[null,null,null,null,null,null,null,null,null,null,null,null,"","","",null,"","",null,"",""]
[null,null,null,null,null,null,null,null,null,null,null,null,"","","",null,"","",null,"",""]
[null,null,null,null,null,null,null,null,null,null,null,null,"","","",null,"","",null,"",""]
[null,null,null,null,null,null,null,null,null,null,null,null,"","","",null,"","",null,"",""]
[null,null,null,null,null,null,null,null,null,null,null,null,"","","",null,"","",null,"",""]
[null,null,null,null,null,null,null,null,null,null,null,null,"","","",null,"","",null,"",""]
[null,null,null,null,null,null,null,null,null,null,null,null,"","","",null,"","",null,"",""]
[null,null,null,null,null,null,null,null,null,null,null,null,"","","",null,"","",null,"",""]
[null,null,null,null,null,null,null,null,null,null,null,null,"","","",null,"","",null,"",""]
[null,null,null,null,null,null,null,null,null,null,null,null,"","","",null,"","",null,"",""]
[null,null,null,null,null,null,null,null,null,null,null,null,"","","",null,"","",null,"",""]
[null,null,null,null,null,null,null,null,null,null,null,null,"","","",null,"","",null,"",""]
[null,null,null,null,null,null,null,null,null,null,null,null,"","","",null,"","",null,"",""]
[null,null,null,null,null,null,null,null,null,null,null,null,"","","",null,"","",null,"",""]
[null,null,null,null,null,null,null,null,null,null,null,null,"","","",null,"","",null,"",""]
[null,null,null,null,null,null,null,null,null,null,null,null,"","","",null,"","",null,"",""]
[null,null,null,null,null,null,null,null,null,null,null,null,"","","",null,"","",null,"",""]
[null,null,null,null,null,null,null,null,null,null,null,null,"","","",null,"","",null,"",""]
[null,null,null,null,null,null,null,null,null,null,null,null,"","","",null,"","",null,"",""]
[null,null,null,null,null,null,null,null,null,null,null,null,"","","",null,"","",null,"",""]
[null,null,null,null,null,null,null,null,null,null,null,null,"","","",null,"","",null,"",""]
[null,null,null,null,null,null,null,null,null,null,null,null,"","","",null,"","",null,"",""]
[null,null,null,null,null,null,null,null,null,null,null,null,"","","",null,"","",null,"",""]
[null,null,null,null,null,null,null,null,null,null,null,null,"","","",null,"","",null,"",""]
[null,null,null,null,null,null,null,null,null,null,null,null,"","","",null,"","",null,"",""]
[null,null,null,null,null,null,null,null,null,null,null,null,"","","",null,"","",null,"",""]
[null,null,null,null,null,null,null,null,null,null,null,null,"","","",null,"","",null,"",""]
[null,null,null,null,null,null,null,null,null,null,null,null,"","","",null,"","",null,"",""]
[null,null,null,null,null,null,null,null,null,null,null,null,"","","",null,"","",null,"",""]
[null,null,null,null,null,null,null,null,null,null,null,null,"","","",null,"","",null,"",""]
[null,null,null,null,null,null,null,null,null,null,null,null,"","","",null,"","",null,"",""]
[null,null,null,null,null,null,null,null,null,null,null,null,"","","",null,"","",null,"",""]
[null,null,null,null,null,null,null,null,null,null,null,null,"","","",null,"","",null,"",""]
[null,null,null,null,null,null,null,null,null,null,null,null,"","","",null,"","",null,"",""]
[null,null,null,null,null,null,null,null,null,null,null,null,"","","",null,"","",null,"",""]
[null,null,null,null,null,null,null,null,null,null,null,null,"","","",null,"","",null,"",""]
[null,null,null,null,null,null,null,null,null,null,null,null,"","","",null,"","",null,"",""]
[null,null,null,null,null,null,null,null,null,null,null,null,"","","",null,"","",null,"",""]
[null,null,null,null,null,null,null,null,null,null,null,null,"","","",null,"","",null,"",""]
[null,null,null,null,null,null,null,null,null,null,null,null,"","","",null,"","",null,"",""]
[null,null,null,null,null,null,null,null,null,null,null,null,"","","",null,"","",null,"",""]
[null,null,null,null,null,null,null,null,null,null,null,null,"","","",null,"","",null,"",""]
[null,null,null,null,null,null,null,null,null,null,null,null,"","","",null,"","",null,"",""]
[null,null,null,null,null,null,null,null,null,null,null,null,"","","",null,"","",null,"",""]
[null,null,null,null,null,null,null,null,null,null,null,null,"","","",null,"","",null,"",""]
[null,null,null,null,null,null,null,null,null,null,null,null,"",{"$f":"IF(ISERROR(VLOOKUP($M451,XX_TEJ6,3,FALSE)=TRUE),\"\",VLOOKUP($M451,XX_TEJ6,3,FALSE))","v":""},{"$f":"IF(ISERROR(VLOOKUP($M451,XX_TEJ7,3,FALSE)=TRUE),\"\",VLOOKUP($M451,XX_TEJ7,3,FALSE))","v":""},null,{"$f":"IF(ISERROR(VLOOKUP($M451,XX_TEJ6,4,FALSE)=TRUE),\"\",VLOOKUP($M451,XX_TEJ6,4,FALSE))","v":""},{"$f":"IF(ISERROR(VLOOKUP($M451,XX_TEJ7,4,FALSE)=TRUE),\"\",VLOOKUP($M451,XX_TEJ7,4,FALSE))","v":""},null,{"$f":"IF(ISERROR(VLOOKUP($M451,XX_TEJ6,5,FALSE)=TRUE),\"\",VLOOKUP($M451,XX_TEJ6,5,FALSE))","v":""},{"$f":"IF(ISERROR(VLOOKUP($M451,XX_TEJ7,5,FALSE)=TRUE),\"\",VLOOKUP($M451,XX_TEJ7,5,FALSE))","v":""}]
[null,null,null,null,null,null,null,null,null,null,null,null,{"$f":"IF($A452=\"\",\"\",$A452)","v":""},"","",null,"","",null,"",""]
[null,null,null,null,null,null,null,null,null,null,null,null,"","","",null,"","",null,"",""]
[null,null,null,null,null,null,null,null,null,null,null,null,"","","",null,"","",null,"",""]
[null,null,null,null,null,null,null,null,null,null,null,null,"","","",null,"","",null,"",""]
[null,null,null,null,null,null,null,null,null,null,null,null,"","","",null,"","",null,"",""]
[null,null,null,null,null,null,null,null,null,null,null,null,"","","",null,"","",null,"",""]
[null,null,null,null,null,null,null,null,null,null,null,null,"","","",null,"","",null,"",""]
[null,null,null,null,null,null,null,null,null,null,null,null,"","","",null,"","",null,"",""]
[null,null,null,null,null,null,null,null,null,null,null,null,"","","",null,"","",null,"",""]
[null,null,null,null,null,null,null,null,null,null,null,null,"","","",null,"","",null,"",""]
[null,null,null,null,null,null,null,null,null,null,null,null,"","","",null,"","",null,"",""]
[null,null,null,null,null,null,null,null,null,null,null,null,"","","",null,"","",null,"",""]
[null,null,null,null,null,null,null,null,null,null,null,null,"","","",null,"","",null,"",""]
[null,null,null,null,null,null,null,null,null,null,null,null,"","","",null,"","",null,"",""]
[null,null,null,null,null,null,null,null,null,null,null,null,"","","",null,"","",null,"",""]
[null,null,null,null,null,null,null,null,null,null,null,null,"","","",null,"","",null,"",""]
[null,null,null,null,null,null,null,null,null,null,null,null,"","","",null,"","",null,"",""]
[null,null,null,null,null,null,null,null,null,null,null,null,"","","",null,"","",null,"",""]
[null,null,null,null,null,null,null,null,null,null,null,null,"","","",null,"","",null,"",""]
[null,null,null,null,null,null,null,null,null,null,null,null,"","","",null,"","",null,"",""]
[null,null,null,null,null,null,null,null,null,null,null,null,"","","",null,"","",null,"",""]
[null,null,null,null,null,null,null,null,null,null,null,null,"","","",null,"","",null,"",""]
[null,null,null,null,null,null,null,null,null,null,null,null,"","","",null,"","",null,"",""]
[null,null,null,null,null,null,null,null,null,null,null,null,"","","",null,"","",null,"",""]
[null,null,null,null,null,null,null,null,null,null,null,null,"","","",null,"","",null,"",""]
[null,null,null,null,null,null,null,null,null,null,null,null,"","","",null,"","",null,"",""]
[null,null,null,null,null,null,null,null,null,null,null,null,"","","",null,"","",null,"",""]
[null,null,null,null,null,null,null,null,null,null,null,null,"","","",null,"","",null,"",""]
[null,null,null,null,null,null,null,null,null,null,null,null,"","","",null,"","",null,"",""]
[null,null,null,null,null,null,null,null,null,null,null,null,"","","",null,"","",null,"",""]
[null,null,null,null,null,null,null,null,null,null,null,null,"","","",null,"","",null,"",""]
[null,null,null,null,null,null,null,null,null,null,null,null,"","","",null,"","",null,"",""]
[null,null,null,null,null,null,null,null,null,null,null,null,"","","",null,"","",null,"",""]
[null,null,null,null,null,null,null,null,null,null,null,null,"","","",null,"","",null,"",""]
[null,null,null,null,null,null,null,null,null,null,null,null,"","","",null,"","",null,"",""]
[null,null,null,null,null,null,null,null,null,null,null,null,"","","",null,"","",null,"",""]
[null,null,null,null,null,null,null,null,null,null,null,null,"","","",null,"","",null,"",""]
[null,null,null,null,null,null,null,null,null,null,null,null,"","","",null,"","",null,"",""]
[null,null,null,null,null,null,null,null,null,null,null,null,"","","",null,"","",null,"",""]
[null,null,null,null,null,null,null,null,null,null,null,null,"","","",null,"","",null,"",""]
[null,null,null,null,null,null,null,null,null,null,null,null,"","","",null,"","",null,"",""]
[null,null,null,null,null,null,null,null,null,null,null,null,"","","",null,"","",null,"",""]
[null,null,null,null,null,null,null,null,null,null,null,null,"","","",null,"","",null,"",""]
[null,null,null,null,null,null,null,null,null,null,null,null,"","","",null,"","",null,"",""]
[null,null,null,null,null,null,null,null,null,null,null,null,"","","",null,"","",null,"",""]
[null,null,null,null,null,null,null,null,null,null,null,null,"","","",null,"","",null,"",""]
[null,null,null,null,null,null,null,null,null,null,null,null,"","","",null,"","",null,"",""]
[null,null,null,null,null,null,null,null,null,null,null,null,"","","",null,"","",null,"",""]
[null,null,null,null,null,null,null,null,null,null,null,null,"","","",null,"","",null,"",""]
[null,null,null,null,null,null,null,null,null,null,null,null,"","","",null,"","",null,"",""]
[null,null,null,null,null,null,null,null,null,null,null,null,"","","",null,"","",null,"",""]
[null,null,null,null,null,null,null,null,null,null,null,null,"","","",null,"","",null,"",""]
[null,null,null,null,null,null,null,null,null,null,null,null,"","","",null,"","",null,"",""]
[null,null,null,null,null,null,null,null,null,null,null,null,"","","",null,"","",null,"",""]
[null,null,null,null,null,null,null,null,null,null,null,null,"","","",null,"","",null,"",""]
[null,null,null,null,null,null,null,null,null,null,null,null,"","","",null,"","",null,"",""]
[null,null,null,null,null,null,null,null,null,null,null,null,"","","",null,"","",null,"",""]
[null,null,null,null,null,null,null,null,null,null,null,null,"","","",null,"","",null,"",""]
[null,null,null,null,null,null,null,null,null,null,null,null,"","","",null,"","",null,"",""]
[null,null,null,null,null,null,null,null,null,null,null,null,"","","",null,"","",null,"",""]
[null,null,null,null,null,null,null,null,null,null,null,null,"","","",null,"","",null,"",""]
[null,null,null,null,null,null,null,null,null,null,null,null,"","","",null,"","",null,"",""]
[null,null,null,null,null,null,null,null,null,null,null,null,"","","",null,"","",null,"",""]
[null,null,null,null,null,null,null,null,null,null,null,null,"",{"$f":"IF(ISERROR(VLOOKUP($M515,XX_TEJ6,3,FALSE)=TRUE),\"\",VLOOKUP($M515,XX_TEJ6,3,FALSE))","v":""},{"$f":"IF(ISERROR(VLOOKUP($M515,XX_TEJ7,3,FALSE)=TRUE),\"\",VLOOKUP($M515,XX_TEJ7,3,FALSE))","v":""},null,{"$f":"IF(ISERROR(VLOOKUP($M515,XX_TEJ6,4,FALSE)=TRUE),\"\",VLOOKUP($M515,XX_TEJ6,4,FALSE))","v":""},{"$f":"IF(ISERROR(VLOOKUP($M515,XX_TEJ7,4,FALSE)=TRUE),\"\",VLOOKUP($M515,XX_TEJ7,4,FALSE))","v":""},null,{"$f":"IF(ISERROR(VLOOKUP($M515,XX_TEJ6,5,FALSE)=TRUE),\"\",VLOOKUP($M515,XX_TEJ6,5,FALSE))","v":""},{"$f":"IF(ISERROR(VLOOKUP($M515,XX_TEJ7,5,FALSE)=TRUE),\"\",VLOOKUP($M515,XX_TEJ7,5,FALSE))","v":""}]
[null,null,null,null,null,null,null,null,null,null,null,null,{"$f":"IF($A516=\"\",\"\",$A516)","v":""},"","",null,"","",null,"",""]
[null,null,null,null,null,null,null,null,null,null,null,null,"","","",null,"","",null,"",""]
[null,null,null,null,null,null,null,null,null,null,null,null,"","","",null,"","",null,"",""]
[null,null,null,null,null,null,null,null,null,null,null,null,"","","",null,"","",null,"",""]
[null,null,null,null,null,null,null,null,null,null,null,null,"","","",null,"","",null,"",""]
[null,null,null,null,null,null,null,null,null,null,null,null,"","","",null,"","",null,"",""]
[null,null,null,null,null,null,null,null,null,null,null,null,"","","",null,"","",null,"",""]
[null,null,null,null,null,null,null,null,null,null,null,null,"","","",null,"","",null,"",""]
[null,null,null,null,null,null,null,null,null,null,null,null,"","","",null,"","",null,"",""]
[null,null,null,null,null,null,null,null,null,null,null,null,"","","",null,"","",null,"",""]
[null,null,null,null,null,null,null,null,null,null,null,null,"","","",null,"","",null,"",""]
[null,null,null,null,null,null,null,null,null,null,null,null,"","","",null,"","",null,"",""]
[null,null,null,null,null,null,null,null,null,null,null,null,"","","",null,"","",null,"",""]
[null,null,null,null,null,null,null,null,null,null,null,null,"","","",null,"","",null,"",""]
[null,null,null,null,null,null,null,null,null,null,null,null,"","","",null,"","",null,"",""]
[null,null,null,null,null,null,null,null,null,null,null,null,"","","",null,"","",null,"",""]
[null,null,null,null,null,null,null,null,null,null,null,null,"","","",null,"","",null,"",""]
[null,null,null,null,null,null,null,null,null,null,null,null,"","","",null,"","",null,"",""]
[null,null,null,null,null,null,null,null,null,null,null,null,"","","",null,"","",null,"",""]
[null,null,null,null,null,null,null,null,null,null,null,null,"","","",null,"","",null,"",""]
[null,null,null,null,null,null,null,null,null,null,null,null,"","","",null,"","",null,"",""]
[null,null,null,null,null,null,null,null,null,null,null,null,"","","",null,"","",null,"",""]
[null,null,null,null,null,null,null,null,null,null,null,null,"","","",null,"","",null,"",""]
[null,null,null,null,null,null,null,null,null,null,null,null,"","","",null,"","",null,"",""]
[null,null,null,null,null,null,null,null,null,null,null,null,"","","",null,"","",null,"",""]
[null,null,null,null,null,null,null,null,null,null,null,null,"","","",null,"","",null,"",""]
[null,null,null,null,null,null,null,null,null,null,null,null,"","","",null,"","",null,"",""]
[null,null,null,null,null,null,null,null,null,null,null,null,"","","",null,"","",null,"",""]
[null,null,null,null,null,null,null,null,null,null,null,null,"","","",null,"","",null,"",""]
[null,null,null,null,null,null,null,null,null,null,null,null,"","","",null,"","",null,"",""]
[null,null,null,null,null,null,null,null,null,null,null,null,"","","",null,"","",null,"",""]
[null,null,null,null,null,null,null,null,null,null,null,null,"","","",null,"","",null,"",""]
[null,null,null,null,null,null,null,null,null,null,null,null,"","","",null,"","",null,"",""]
[null,null,null,null,null,null,null,null,null,null,null,null,"","","",null,"","",null,"",""]
[null,null,null,null,null,null,null,null,null,null,null,null,"","","",null,"","",null,"",""]
[null,null,null,null,null,null,null,null,null,null,null,null,"","","",null,"","",null,"",""]
[null,null,null,null,null,null,null,null,null,null,null,null,"","","",null,"","",null,"",""]
[null,null,null,null,null,null,null,null,null,null,null,null,"","","",null,"","",null,"",""]
[null,null,null,null,null,null,null,null,null,null,null,null,"","","",null,"","",null,"",""]
[null,null,null,null,null,null,null,null,null,null,null,null,"","","",null,"","",null,"",""]
[null,null,null,null,null,null,null,null,null,null,null,null,"","","",null,"","",null,"",""]
[null,null,null,null,null,null,null,null,null,null,null,null,"","","",null,"","",null,"",""]
[null,null,null,null,null,null,null,null,null,null,null,null,"","","",null,"","",null,"",""]
[null,null,null,null,null,null,null,null,null,null,null,null,"","","",null,"","",null,"",""]
[null,null,null,null,null,null,null,null,null,null,null,null,"","","",null,"","",null,"",""]
[null,null,null,null,null,null,null,null,null,null,null,null,"","","",null,"","",null,"",""]
[null,null,null,null,null,null,null,null,null,null,null,null,"","","",null,"","",null,"",""]
[null,null,null,null,null,null,null,null,null,null,null,null,"","","",null,"","",null,"",""]
[null,null,null,null,null,null,null,null,null,null,null,null,"","","",null,"","",null,"",""]
[null,null,null,null,null,null,null,null,null,null,null,null,"","","",null,"","",null,"",""]
[null,null,null,null,null,null,null,null,null,null,null,null,"","","",null,"","",null,"",""]
[null,null,null,null,null,null,null,null,null,null,null,null,"","","",null,"","",null,"",""]
[null,null,null,null,null,null,null,null,null,null,null,null,"","","",null,"","",null,"",""]
[null,null,null,null,null,null,null,null,null,null,null,null,"","","",null,"","",null,"",""]
[null,null,null,null,null,null,null,null,null,null,null,null,"","","",null,"","",null,"",""]
[null,null,null,null,null,null,null,null,null,null,null,null,"","","",null,"","",null,"",""]
[null,null,null,null,null,null,null,null,null,null,null,null,"","","",null,"","",null,"",""]
[null,null,null,null,null,null,null,null,null,null,null,null,"","","",null,"","",null,"",""]
[null,null,null,null,null,null,null,null,null,null,null,null,"","","",null,"","",null,"",""]
[null,null,null,null,null,null,null,null,null,null,null,null,"","","",null,"","",null,"",""]
[null,null,null,null,null,null,null,null,null,null,null,null,"","","",null,"","",null,"",""]
[null,null,null,null,null,null,null,null,null,null,null,null,"","","",null,"","",null,"",""]
[null,null,null,null,null,null,null,null,null,null,null,null,"","","",null,"","",null,"",""]
[null,null,null,null,null,null,null,null,null,null,null,null,"",{"$f":"IF(ISERROR(VLOOKUP($M579,XX_TEJ6,3,FALSE)=TRUE),\"\",VLOOKUP($M579,XX_TEJ6,3,FALSE))","v":""},{"$f":"IF(ISERROR(VLOOKUP($M579,XX_TEJ7,3,FALSE)=TRUE),\"\",VLOOKUP($M579,XX_TEJ7,3,FALSE))","v":""},null,{"$f":"IF(ISERROR(VLOOKUP($M579,XX_TEJ6,4,FALSE)=TRUE),\"\",VLOOKUP($M579,XX_TEJ6,4,FALSE))","v":""},{"$f":"IF(ISERROR(VLOOKUP($M579,XX_TEJ7,4,FALSE)=TRUE),\"\",VLOOKUP($M579,XX_TEJ7,4,FALSE))","v":""},null,{"$f":"IF(ISERROR(VLOOKUP($M579,XX_TEJ6,5,FALSE)=TRUE),\"\",VLOOKUP($M579,XX_TEJ6,5,FALSE))","v":""},{"$f":"IF(ISERROR(VLOOKUP($M579,XX_TEJ7,5,FALSE)=TRUE),\"\",VLOOKUP($M579,XX_TEJ7,5,FALSE))","v":""}]
[null,null,null,null,null,null,null,null,null,null,null,null,{"$f":"IF($A580=\"\",\"\",$A580)","v":""},"","",null,"","",null,"",""]
[null,null,null,null,null,null,null,null,null,null,null,null,"","","",null,"","",null,"",""]
[null,null,null,null,null,null,null,null,null,null,null,null,"","","",null,"","",null,"",""]
[null,null,null,null,null,null,null,null,null,null,null,null,"","","",null,"","",null,"",""]
[null,null,null,null,null,null,null,null,null,null,null,null,"","","",null,"","",null,"",""]
[null,null,null,null,null,null,null,null,null,null,null,null,"","","",null,"","",null,"",""]
[null,null,null,null,null,null,null,null,null,null,null,null,"","","",null,"","",null,"",""]
[null,null,null,null,null,null,null,null,null,null,null,null,"","","",null,"","",null,"",""]
[null,null,null,null,null,null,null,null,null,null,null,null,"","","",null,"","",null,"",""]
[null,null,null,null,null,null,null,null,null,null,null,null,"","","",null,"","",null,"",""]
[null,null,null,null,null,null,null,null,null,null,null,null,"","","",null,"","",null,"",""]
[null,null,null,null,null,null,null,null,null,null,null,null,"","","",null,"","",null,"",""]
[null,null,null,null,null,null,null,null,null,null,null,null,"","","",null,"","",null,"",""]
[null,null,null,null,null,null,null,null,null,null,null,null,"","","",null,"","",null,"",""]
[null,null,null,null,null,null,null,null,null,null,null,null,"","","",null,"","",null,"",""]
[null,null,null,null,null,null,null,null,null,null,null,null,"","","",null,"","",null,"",""]
[null,null,null,null,null,null,null,null,null,null,null,null,"","","",null,"","",null,"",""]
[null,null,null,null,null,null,null,null,null,null,null,null,"","","",null,"","",null,"",""]
[null,null,null,null,null,null,null,null,null,null,null,null,"","","",null,"","",null,"",""]
[null,null,null,null,null,null,null,null,null,null,null,null,"","","",null,"","",null,"",""]
[null,null,null,null,null,null,null,null,null,null,null,null,"","","",null,"","",null,"",""]
[null,null,null,null,null,null,null,null,null,null,null,null,"","","",null,"","",null,"",""]
[null,null,null,null,null,null,null,null,null,null,null,null,"","","",null,"","",null,"",""]
[null,null,null,null,null,null,null,null,null,null,null,null,"","","",null,"","",null,"",""]
[null,null,null,null,null,null,null,null,null,null,null,null,"","","",null,"","",null,"",""]
[null,null,null,null,null,null,null,null,null,null,null,null,"","","",null,"","",null,"",""]
[null,null,null,null,null,null,null,null,null,null,null,null,"","","",null,"","",null,"",""]
[null,null,null,null,null,null,null,null,null,null,null,null,"","","",null,"","",null,"",""]
[null,null,null,null,null,null,null,null,null,null,null,null,"","","",null,"","",null,"",""]
[null,null,null,null,null,null,null,null,null,null,null,null,"","","",null,"","",null,"",""]
[null,null,null,null,null,null,null,null,null,null,null,null,"","","",null,"","",null,"",""]
[null,null,null,null,null,null,null,null,null,null,null,null,"","","",null,"","",null,"",""]
[null,null,null,null,null,null,null,null,null,null,null,null,"","","",null,"","",null,"",""]
[null,null,null,null,null,null,null,null,null,null,null,null,"","","",null,"","",null,"",""]
[null,null,null,null,null,null,null,null,null,null,null,null,"","","",null,"","",null,"",""]
[null,null,null,null,null,null,null,null,null,null,null,null,"","","",null,"","",null,"",""]
[null,null,null,null,null,null,null,null,null,null,null,null,"","","",null,"","",null,"",""]
[null,null,null,null,null,null,null,null,null,null,null,null,"","","",null,"","",null,"",""]
[null,null,null,null,null,null,null,null,null,null,null,null,"","","",null,"","",null,"",""]
[null,null,null,null,null,null,null,null,null,null,null,null,"","","",null,"","",null,"",""]
[null,null,null,null,null,null,null,null,null,null,null,null,"","","",null,"","",null,"",""]
[null,null,null,null,null,null,null,null,null,null,null,null,"","","",null,"","",null,"",""]
[null,null,null,null,null,null,null,null,null,null,null,null,"","","",null,"","",null,"",""]
[null,null,null,null,null,null,null,null,null,null,null,null,"","","",null,"","",null,"",""]
[null,null,null,null,null,null,null,null,null,null,null,null,"","","",null,"","",null,"",""]
[null,null,null,null,null,null,null,null,null,null,null,null,"","","",null,"","",null,"",""]
[null,null,null,null,null,null,null,null,null,null,null,null,"","","",null,"","",null,"",""]
[null,null,null,null,null,null,null,null,null,null,null,null,"","","",null,"","",null,"",""]
[null,null,null,null,null,null,null,null,null,null,null,null,"","","",null,"","",null,"",""]
[null,null,null,null,null,null,null,null,null,null,null,null,"","","",null,"","",null,"",""]
[null,null,null,null,null,null,null,null,null,null,null,null,"","","",null,"","",null,"",""]
[null,null,null,null,null,null,null,null,null,null,null,null,"","","",null,"","",null,"",""]
[null,null,null,null,null,null,null,null,null,null,null,null,"","","",null,"","",null,"",""]
[null,null,null,null,null,null,null,null,null,null,null,null,"","","",null,"","",null,"",""]
[null,null,null,null,null,null,null,null,null,null,null,null,"","","",null,"","",null,"",""]
[null,null,null,null,null,null,null,null,null,null,null,null,"","","",null,"","",null,"",""]
[null,null,null,null,null,null,null,null,null,null,null,null,"","","",null,"","",null,"",""]
[null,null,null,null,null,null,null,null,null,null,null,null,"","","",null,"","",null,"",""]
[null,null,null,null,null,null,null,null,null,null,null,null,"","","",null,"","",null,"",""]
[null,null,null,null,null,null,null,null,null,null,null,null,"","","",null,"","",null,"",""]
[null,null,null,null,null,null,null,null,null,null,null,null,"","","",null,"","",null,"",""]
[null,null,null,null,null,null,null,null,null,null,null,null,"","","",null,"","",null,"",""]
[null,null,null,null,null,null,null,null,null,null,null,null,"","","",null,"","",null,"",""]
[null,null,null,null,null,null,null,null,null,null,null,null,"",{"$f":"IF(ISERROR(VLOOKUP($M643,XX_TEJ6,3,FALSE)=TRUE),\"\",VLOOKUP($M643,XX_TEJ6,3,FALSE))","v":""},{"$f":"IF(ISERROR(VLOOKUP($M643,XX_TEJ7,3,FALSE)=TRUE),\"\",VLOOKUP($M643,XX_TEJ7,3,FALSE))","v":""},null,{"$f":"IF(ISERROR(VLOOKUP($M643,XX_TEJ6,4,FALSE)=TRUE),\"\",VLOOKUP($M643,XX_TEJ6,4,FALSE))","v":""},{"$f":"IF(ISERROR(VLOOKUP($M643,XX_TEJ7,4,FALSE)=TRUE),\"\",VLOOKUP($M643,XX_TEJ7,4,FALSE))","v":""},null,{"$f":"IF(ISERROR(VLOOKUP($M643,XX_TEJ6,5,FALSE)=TRUE),\"\",VLOOKUP($M643,XX_TEJ6,5,FALSE))","v":""},{"$f":"IF(ISERROR(VLOOKUP($M643,XX_TEJ7,5,FALSE)=TRUE),\"\",VLOOKUP($M643,XX_TEJ7,5,FALSE))","v":""}]
[null,null,null,null,null,null,null,null,null,null,null,null,{"$f":"IF($A644=\"\",\"\",$A644)","v":""},"","",null,"","",null,"",""]
[null,null,null,null,null,null,null,null,null,null,null,null,"","","",null,"","",null,"",""]
[null,null,null,null,null,null,null,null,null,null,null,null,"","","",null,"","",null,"",""]
[null,null,null,null,null,null,null,null,null,null,null,null,"","","",null,"","",null,"",""]
[null,null,null,null,null,null,null,null,null,null,null,null,"","","",null,"","",null,"",""]
[null,null,null,null,null,null,null,null,null,null,null,null,"","","",null,"","",null,"",""]
[null,null,null,null,null,null,null,null,null,null,null,null,"","","",null,"","",null,"",""]
[null,null,null,null,null,null,null,null,null,null,null,null,"","","",null,"","",null,"",""]
[null,null,null,null,null,null,null,null,null,null,null,null,"","","",null,"","",null,"",""]
[null,null,null,null,null,null,null,null,null,null,null,null,"","","",null,"","",null,"",""]
[null,null,null,null,null,null,null,null,null,null,null,null,"","","",null,"","",null,"",""]
[null,null,null,null,null,null,null,null,null,null,null,null,"","","",null,"","",null,"",""]
[null,null,null,null,null,null,null,null,null,null,null,null,"","","",null,"","",null,"",""]
[null,null,null,null,null,null,null,null,null,null,null,null,"","","",null,"","",null,"",""]
[null,null,null,null,null,null,null,null,null,null,null,null,"","","",null,"","",null,"",""]
[null,null,null,null,null,null,null,null,null,null,null,null,"","","",null,"","",null,"",""]
[null,null,null,null,null,null,null,null,null,null,null,null,"","","",null,"","",null,"",""]
[null,null,null,null,null,null,null,null,null,null,null,null,"","","",null,"","",null,"",""]
[null,null,null,null,null,null,null,null,null,null,null,null,"","","",null,"","",null,"",""]
[null,null,null,null,null,null,null,null,null,null,null,null,"","","",null,"","",null,"",""]
[null,null,null,null,null,null,null,null,null,null,null,null,"","","",null,"","",null,"",""]
[null,null,null,null,null,null,null,null,null,null,null,null,"","","",null,"","",null,"",""]
[null,null,null,null,null,null,null,null,null,null,null,null,"","","",null,"","",null,"",""]
[null,null,null,null,null,null,null,null,null,null,null,null,"","","",null,"","",null,"",""]
[null,null,null,null,null,null,null,null,null,null,null,null,"","","",null,"","",null,"",""]
[null,null,null,null,null,null,null,null,null,null,null,null,"","","",null,"","",null,"",""]
[null,null,null,null,null,null,null,null,null,null,null,null,"","","",null,"","",null,"",""]
[null,null,null,null,null,null,null,null,null,null,null,null,"","","",null,"","",null,"",""]
[null,null,null,null,null,null,null,null,null,null,null,null,"","","",null,"","",null,"",""]
[null,null,null,null,null,null,null,null,null,null,null,null,"","","",null,"","",null,"",""]
[null,null,null,null,null,null,null,null,null,null,null,null,"","","",null,"","",null,"",""]
[null,null,null,null,null,null,null,null,null,null,null,null,"","","",null,"","",null,"",""]
[null,null,null,null,null,null,null,null,null,null,null,null,"","","",null,"","",null,"",""]
[null,null,null,null,null,null,null,null,null,null,null,null,"","","",null,"","",null,"",""]
[null,null,null,null,null,null,null,null,null,null,null,null,"","","",null,"","",null,"",""]
[null,null,null,null,null,null,null,null,null,null,null,null,"","","",null,"","",null,"",""]
[null,null,null,null,null,null,null,null,null,null,null,null,"","","",null,"","",null,"",""]
[null,null,null,null,null,null,null,null,null,null,null,null,"","","",null,"","",null,"",""]
[null,null,null,null,null,null,null,null,null,null,null,null,"","","",null,"","",null,"",""]
[null,null,null,null,null,null,null,null,null,null,null,null,"","","",null,"","",null,"",""]
[null,null,null,null,null,null,null,null,null,null,null,null,"","","",null,"","",null,"",""]
[null,null,null,null,null,null,null,null,null,null,null,null,"","","",null,"","",null,"",""]
[null,null,null,null,null,null,null,null,null,null,null,null,"","","",null,"","",null,"",""]
[null,null,null,null,null,null,null,null,null,null,null,null,"","","",null,"","",null,"",""]
[null,null,null,null,null,null,null,null,null,null,null,null,"","","",null,"","",null,"",""]
[null,null,null,null,null,null,null,null,null,null,null,null,"","","",null,"","",null,"",""]
[null,null,null,null,null,null,null,null,null,null,null,null,"","","",null,"","",null,"",""]
[null,null,null,null,null,null,null,null,null,null,null,null,"","","",null,"","",null,"",""]
[null,null,null,null,null,null,null,null,null,null,null,null,"","","",null,"","",null,"",""]
[null,null,null,null,null,null,null,null,null,null,null,null,"","","",null,"","",null,"",""]
[null,null,null,null,null,null,null,null,null,null,null,null,"","","",null,"","",null,"",""]
[null,null,null,null,null,null,null,null,null,null,null,null,"","","",null,"","",null,"",""]
[null,null,null,null,null,null,null,null,null,null,null,null,"","","",null,"","",null,"",""]
[null,null,null,null,null,null,null,null,null,null,null,null,"","","",null,"","",null,"",""]
[null,null,null,null,null,null,null,null,null,null,null,null,"","","",null,"","",null,"",""]
[null,null,null,null,null,null,null,null,null,null,null,null,"","","",null,"","",null,"",""]
[null,null,null,null,null,null,null,null,null,null,null,null,"","","",null,"","",null,"",""]
[null,null,null,null,null,null,null,null,null,null,null,null,"","","",null,"","",null,"",""]
[null,null,null,null,null,null,null,null,null,null,null,null,"","","",null,"","",null,"",""]
[null,null,null,null,null,null,null,null,null,null,null,null,"","","",null,"","",null,"",""]
[null,null,null,null,null,null,null,null,null,null,null,null,"","","",null,"","",null,"",""]
[null,null,null,null,null,null,null,null,null,null,null,null,"","","",null,"","",null,"",""]